{"text_format":"3","workbook":"xlsx","n_sheets":14,"sheets":["Dane","System DN63","System DN75","System DN90","Centrala Vitovent","Centrala Vitoair FS","Elementy DN63","Elementy DN75&90","Obliczenia","Dane techniczne","Zmiany","Warunki","obliczenia-temp","Arkusz1"],"not_rendered":{"images":240,"macros":1,"external_links":2,"defined_names":66,"comments":1},"read":"whole","date_system":"1900"}

{"sheet":"Dane","index":0,"n_rows":241,"n_cols":20,"rows_kept":241,"merged":[[0,7,0,9],[2,14,3,14],[2,15,3,16],[2,18,3,19],[7,2,8,14],[10,2,11,9],[16,7,16,9],[16,10,16,11],[19,10,19,11],[22,7,22,9],[22,10,22,11],[27,18,27,19],[31,2,33,2],[31,4,31,7],[31,15,31,16],[32,4,32,7],[32,17,33,17],[37,2,39,2],[37,4,37,7],[37,15,37,16],[38,4,38,7],[38,17,39,17],[43,2,45,2],[43,4,43,7],[43,15,43,16],[44,4,44,7],[44,17,45,17],[49,2,51,2],[49,4,49,7],[49,15,49,16],[50,4,50,7],[50,17,51,17],[55,2,57,2],[55,4,55,7],[55,15,55,16],[56,4,56,7],[56,17,57,17],[61,2,63,2],[61,4,61,7],[61,15,61,16],[62,4,62,7],[62,17,63,17],[67,2,69,2],[67,4,67,7],[67,15,67,16],[68,4,68,7],[68,17,69,17],[73,2,75,2],[73,4,73,7],[73,15,73,16],[74,4,74,7],[74,17,75,17],[79,2,81,2],[79,4,79,7],[79,15,79,16],[80,4,80,7],[80,17,81,17],[85,2,87,2],[85,4,85,7],[85,15,85,16],[86,4,86,7],[86,17,87,17],[91,2,93,2],[91,4,91,7],[91,15,91,16],[92,4,92,7],[92,17,93,17],[97,2,99,2],[97,4,97,7],[97,15,97,16],[98,4,98,7],[98,17,99,17],[116,18,116,19],[120,2,122,2],[120,4,120,7],[120,15,120,16],[121,4,121,7],[121,17,122,17],[125,2,127,2],[125,4,125,7],[125,15,125,16],[126,4,126,7],[126,17,127,17],[131,2,133,2],[131,4,131,7],[131,15,131,16],[132,4,132,7],[132,17,133,17],[137,2,139,2],[137,4,137,7],[137,15,137,16],[138,4,138,7],[138,17,139,17],[143,2,145,2],[143,4,143,7],[143,15,143,16],[144,4,144,7],[144,17,145,17],[149,2,151,2],[149,4,149,7],[149,15,149,16],[150,4,150,7],[150,17,151,17],[155,2,157,2],[155,4,155,7],[155,15,155,16],[156,4,156,7],[156,17,157,17],[161,2,163,2],[161,4,161,7],[161,15,161,16],[162,4,162,7],[162,17,163,17],[169,18,169,19],[173,3,174,6],[173,12,174,15],[188,13,190,17],[192,18,192,19],[196,3,197,6],[199,2,200,6],[199,7,200,7],[199,8,200,8],[199,10,200,15],[203,3,204,5],[203,11,205,12],[206,11,206,12],[210,9,211,10],[210,13,211,13],[212,3,212,4],[212,9,214,10],[212,11,212,12],[212,13,214,15],[217,2,218,6],[219,2,220,19],[221,2,222,19],[223,2,224,19],[228,2,229,6],[228,12,229,16],[230,2,231,6],[230,12,231,16],[232,2,233,6],[232,12,233,16],[238,2,240,15]]}
[{"$nulls":7},"Bilans ruchu powietrza",null,null,{"$f":"IF(S1<=P1,IF(S1>P1*0.97,\"prawidłowy\",\"błędny\"),\"błędny\")","v":"prawidłowy"},{"$nulls":3},"Nawiew",{"$f":"Obliczenia!N30","v":200},"[m3/h]","Wywiew",{"$f":"Obliczenia!P30","v":200},"[m3/h]"]
[]
[{"$nulls":14},"Data:   ",{"$f":"TODAY()","v":"2023-10-25"},null,null,"wersja 23/10/2023"]
[]
[]
[]
[]
[null,null,"Program doborowy centralnej wentylacji mechanicznej z odzyskiem ciepła"]
[]
[]
[null,null,"Symulację przygotowano dla…"]
[]
[]
[]
[]
[]
[null,null,"Powierzchnia wentylowana budynku",{"$nulls":4},85,null,null,"[ m2 ]"]
[{"$nulls":8},"35 - 500"]
[]
[]
[]
[]
[null,null,"Liczba mieszkańców",{"$nulls":4},4,null,null,{"$f":"IF(H23=1,\"[ osoba ]\",IF(H23<5,\"[ osoby ]\",\"[ osób ]\"))","v":"[ osoby ]"}]
[{"$nulls":8},"1 - 10"]
[]
[]
[]
[null,null,"Lista wentylowanych pomieszczeń"]
[]
[]
[]
[null,null,"0.1",null,"Wiatrołap",{"$nulls":4},"Powierzchnia",null,"Wysokość",null,"Kubatura",null,"Ruch powietrza",null,{"$f":"IF(E32=\"\",\"n.d.\",VLOOKUP(E32,lista_pod_rodzaj_ruchu_powietrza,4,0))","v":"wywiew"},null,{"$f":"IF(Q33>S33,0,1)","v":1}]
[{"$nulls":4},"0.1 Wiatrołap",{"$nulls":4},6.9,null,2.8,null,{"$f":"L33*J33","v":19.32},null,"norma m3/h",{"$f":"IF(R32=\"n.d.\",0,IF(R32=\"nawiew\",G34*20,VLOOKUP(E32,warunki2,3,0)))","v":15},{"$f":"IF(R32=\"n.d.\",-1,IF(R32=\"nawiew\",0,IF(R32=\"wywiew\",1,IF(R32=\"naw.wyw.\",0.5,2))))","v":1},25,"m3/h"]
[{"$nulls":4},"Ilość osób",{"$f":"IF(R32<>\"nawiew\",\"n.d.\",\"\")","v":"n.d."},2,null,null,"[m2]",null,"[m]",null,"[m3]",null,"min. m3/h",{"$f":"N33","v":{"v":19.32,"d":"19"}}]
[]
[]
[]
[null,null,"0.2",null,"Łazienka",{"$nulls":4},"Powierzchnia",null,"Wysokość",null,"Kubatura",null,"Ruch powietrza",null,{"$f":"IF(E38=\"\",\"n.d.\",VLOOKUP(E38,lista_pod_rodzaj_ruchu_powietrza,4,0))","v":"wywiew"},null,{"$f":"IF(Q39>S39,0,1)","v":1}]
[{"$nulls":4},"03. Łazienka",{"$nulls":4},4.72,null,2.8,null,{"$f":"L39*J39","v":{"v":13.216,"d":"13.22"}},null,"norma m3/h",{"$f":"IF(R38=\"n.d.\",0,IF(R38=\"nawiew\",G40*20,VLOOKUP(E38,warunki2,3,0)))","v":50},{"$f":"IF(R38=\"n.d.\",-1,IF(R38=\"nawiew\",0,IF(R38=\"wywiew\",1,IF(R38=\"naw.wyw.\",0.5,2))))","v":1},75,"m3/h"]
[{"$nulls":4},"Ilość osób",{"$f":"IF(R38<>\"nawiew\",\"n.d.\",\"\")","v":"n.d."},2,null,null,"[m2]",null,"[m]",null,"[m3]",null,"min. m3/h",{"$f":"N39","v":{"v":13.216,"d":"13"}}]
[]
[]
[]
[null,null,"0.3",null,"Kuchnia otwarta z kuchenką elektryczną",{"$nulls":4},"Powierzchnia",null,"Wysokość",null,"Kubatura",null,"Ruch powietrza",null,{"$f":"IF(E44=\"\",\"n.d.\",VLOOKUP(E44,lista_pod_rodzaj_ruchu_powietrza,4,0))","v":"wywiew"},null,{"$f":"IF(Q45>S45,0,1)","v":1}]
[{"$nulls":4},"04. Kuchnia",{"$nulls":4},15.52,null,2.8,null,{"$f":"L45*J45","v":{"v":43.455999999999996,"d":"43.46"}},null,"norma m3/h",{"$f":"IF(R44=\"n.d.\",0,IF(R44=\"nawiew\",G46*20,VLOOKUP(E44,warunki2,3,0)))","v":50},{"$f":"IF(R44=\"n.d.\",-1,IF(R44=\"nawiew\",0,IF(R44=\"wywiew\",1,IF(R44=\"naw.wyw.\",0.5,2))))","v":1},75,"m3/h"]
[{"$nulls":4},"Ilość osób",{"$f":"IF(R44<>\"nawiew\",\"n.d.\",\"\")","v":"n.d."},2,null,null,"[m2]",null,"[m]",null,"[m3]",null,"min. m3/h",{"$f":"N45","v":{"v":43.455999999999996,"d":"43"}}]
[]
[]
[]
[null,null,"0.4",null,"Jadalnia - nawiew",{"$nulls":4},"Powierzchnia",null,"Wysokość",null,"Kubatura",null,"Ruch powietrza",null,{"$f":"IF(E50=\"\",\"n.d.\",VLOOKUP(E50,lista_pod_rodzaj_ruchu_powietrza,4,0))","v":"nawiew"},null,{"$f":"IF(Q51>S51,0,1)","v":1}]
[{"$nulls":4},"0.5 Jadalnia",{"$nulls":4},21.37,null,4,null,{"$f":"L51*J51","v":85.48},null,"norma m3/h",{"$f":"IF(R50=\"n.d.\",0,IF(R50=\"nawiew\",G52*20,VLOOKUP(E50,warunki2,3,0)))","v":40},{"$f":"IF(R50=\"n.d.\",-1,IF(R50=\"nawiew\",0,IF(R50=\"wywiew\",1,IF(R50=\"naw.wyw.\",0.5,2))))","v":0},80,"m3/h"]
[{"$nulls":4},"Ilość osób",{"$f":"IF(R50<>\"nawiew\",\"n.d.\",\"\")","v":""},2,null,null,"[m2]",null,"[m]",null,"[m3]",null,"min. m3/h",{"$f":"N51","v":{"v":85.48,"d":"85"}}]
[]
[]
[]
[null,null,"0.5",null,"Salon",{"$nulls":4},"Powierzchnia",null,"Wysokość",null,"Kubatura",null,"Ruch powietrza",null,{"$f":"IF(E56=\"\",\"n.d.\",VLOOKUP(E56,lista_pod_rodzaj_ruchu_powietrza,4,0))","v":"nawiew"},null,{"$f":"IF(Q57>S57,0,1)","v":1}]
[{"$nulls":4},"0.6 Salon",{"$nulls":4},32.09,null,4,null,{"$f":"L57*J57","v":128.36},null,"norma m3/h",{"$f":"IF(R56=\"n.d.\",0,IF(R56=\"nawiew\",G58*20,VLOOKUP(E56,warunki2,3,0)))","v":80},{"$f":"IF(R56=\"n.d.\",-1,IF(R56=\"nawiew\",0,IF(R56=\"wywiew\",1,IF(R56=\"naw.wyw.\",0.5,2))))","v":0},120,"m3/h"]
[{"$nulls":4},"Ilość osób",{"$f":"IF(R56<>\"nawiew\",\"n.d.\",\"\")","v":""},4,null,null,"[m2]",null,"[m]",null,"[m3]",null,"min. m3/h",{"$f":"N57","v":{"v":128.36,"d":"128"}}]
[]
[]
[]
[null,null,"0.6",null,"Spiżarnia",{"$nulls":4},"Powierzchnia",null,"Wysokość",null,"Kubatura",null,"Ruch powietrza",null,{"$f":"IF(E62=\"\",\"n.d.\",VLOOKUP(E62,lista_pod_rodzaj_ruchu_powietrza,4,0))","v":"wywiew"},null,{"$f":"IF(Q63>S63,0,1)","v":1}]
[{"$nulls":4},"04.a Spiżarnia",{"$nulls":4},4.23,null,2.8,null,{"$f":"L63*J63","v":{"v":11.844000000000001,"d":"11.84"}},null,"norma m3/h",{"$f":"IF(R62=\"n.d.\",0,IF(R62=\"nawiew\",G64*20,VLOOKUP(E62,warunki2,3,0)))","v":15},{"$f":"IF(R62=\"n.d.\",-1,IF(R62=\"nawiew\",0,IF(R62=\"wywiew\",1,IF(R62=\"naw.wyw.\",0.5,2))))","v":1},25,"m3/h"]
[{"$nulls":4},"Ilość osób",{"$f":"IF(R62<>\"nawiew\",\"n.d.\",\"\")","v":"n.d."},1,null,null,"[m2]",null,"[m]",null,"[m3]",null,"min. m3/h",{"$f":"N63","v":{"v":11.844000000000001,"d":"12"}}]
[]
[]
[]
[null,null,"0.7",{"$nulls":6},"Powierzchnia",null,"Wysokość",null,"Kubatura",null,"Ruch powietrza",null,{"$f":"IF(E68=\"\",\"n.d.\",VLOOKUP(E68,lista_pod_rodzaj_ruchu_powietrza,4,0))","v":"n.d."},null,{"$f":"IF(Q69>S69,0,1)","v":1}]
[{"$nulls":9},5,null,2.7,null,{"$f":"L69*J69","v":{"v":13.5,"d":"13.50"}},null,"norma m3/h",{"$f":"IF(R68=\"n.d.\",0,IF(R68=\"nawiew\",G70*20,VLOOKUP(E68,warunki2,3,0)))","v":0},{"$f":"IF(R68=\"n.d.\",-1,IF(R68=\"nawiew\",0,IF(R68=\"wywiew\",1,IF(R68=\"naw.wyw.\",0.5,2))))","v":-1},0,"m3/h"]
[{"$nulls":4},"Ilość osób",{"$f":"IF(R68<>\"nawiew\",\"n.d.\",\"\")","v":"n.d."},0,null,null,"[m2]",null,"[m]",null,"[m3]",null,"min. m3/h",{"$f":"N69","v":{"v":13.5,"d":"14"}}]
[]
[]
[]
[null,null,"0.8",{"$nulls":6},"Powierzchnia",null,"Wysokość",null,"Kubatura",null,"Ruch powietrza",null,{"$f":"IF(E74=\"\",\"n.d.\",VLOOKUP(E74,lista_pod_rodzaj_ruchu_powietrza,4,0))","v":"n.d."},null,{"$f":"IF(Q75>S75,0,1)","v":1}]
[{"$nulls":9},8.71,null,2.7,null,{"$f":"L75*J75","v":{"v":23.517000000000003,"d":"23.52"}},null,"norma m3/h",{"$f":"IF(R74=\"n.d.\",0,IF(R74=\"nawiew\",G76*20,VLOOKUP(E74,warunki2,3,0)))","v":0},{"$f":"IF(R74=\"n.d.\",-1,IF(R74=\"nawiew\",0,IF(R74=\"wywiew\",1,IF(R74=\"naw.wyw.\",0.5,2))))","v":-1},0,"m3/h"]
[{"$nulls":4},"Ilość osób",{"$f":"IF(R74<>\"nawiew\",\"n.d.\",\"\")","v":"n.d."},0,null,null,"[m2]",null,"[m]",null,"[m3]",null,"min. m3/h",{"$f":"N75","v":{"v":23.517000000000003,"d":"24"}}]
[]
[]
[]
[null,null,"0.9",{"$nulls":6},"Powierzchnia",null,"Wysokość",null,"Kubatura",null,"Ruch powietrza",null,{"$f":"IF(E80=\"\",\"n.d.\",VLOOKUP(E80,lista_pod_rodzaj_ruchu_powietrza,4,0))","v":"n.d."},null,{"$f":"IF(Q81>S81,0,1)","v":1}]
[{"$nulls":9},21.3,null,2.7,null,{"$f":"L81*J81","v":{"v":57.510000000000005,"d":"57.51"}},null,"norma m3/h",{"$f":"IF(R80=\"n.d.\",0,IF(R80=\"nawiew\",G82*20,VLOOKUP(E80,warunki2,3,0)))","v":0},{"$f":"IF(R80=\"n.d.\",-1,IF(R80=\"nawiew\",0,IF(R80=\"wywiew\",1,IF(R80=\"naw.wyw.\",0.5,2))))","v":-1},0,"m3/h"]
[{"$nulls":4},"Ilość osób",{"$f":"IF(R80<>\"nawiew\",\"n.d.\",\"\")","v":"n.d."},0,null,null,"[m2]",null,"[m]",null,"[m3]",null,"min. m3/h",{"$f":"N81","v":{"v":57.510000000000005,"d":"58"}}]
[]
[]
[]
[null,null,"0.10",{"$nulls":6},"Powierzchnia",null,"Wysokość",null,"Kubatura",null,"Ruch powietrza",null,{"$f":"IF(E86=\"\",\"n.d.\",VLOOKUP(E86,lista_pod_rodzaj_ruchu_powietrza,4,0))","v":"n.d."},null,{"$f":"IF(Q87>S87,0,1)","v":1}]
[{"$nulls":9},14.26,null,2.7,null,{"$f":"L87*J87","v":{"v":38.502,"d":"38.50"}},null,"norma m3/h",{"$f":"IF(R86=\"n.d.\",0,IF(R86=\"nawiew\",G88*20,VLOOKUP(E86,warunki2,3,0)))","v":0},{"$f":"IF(R86=\"n.d.\",-1,IF(R86=\"nawiew\",0,IF(R86=\"wywiew\",1,IF(R86=\"naw.wyw.\",0.5,2))))","v":-1},{"$f":"Q87","v":0},"m3/h"]
[{"$nulls":4},"Ilość osób",{"$f":"IF(R86<>\"nawiew\",\"n.d.\",\"\")","v":"n.d."},0,null,null,"[m2]",null,"[m]",null,"[m3]",null,"min. m3/h",{"$f":"N87","v":{"v":38.502,"d":"39"}}]
[]
[]
[]
[null,null,"0.11",{"$nulls":6},"Powierzchnia",null,"Wysokość",null,"Kubatura",null,"Ruch powietrza",null,{"$f":"IF(E92=\"\",\"n.d.\",VLOOKUP(E92,lista_pod_rodzaj_ruchu_powietrza,4,0))","v":"n.d."},null,{"$f":"IF(Q93>S93,0,1)","v":1}]
[{"$nulls":9},6,null,2.7,null,{"$f":"L93*J93","v":{"v":16.200000000000003,"d":"16.20"}},null,"norma m3/h",{"$f":"IF(R92=\"n.d.\",0,IF(R92=\"nawiew\",G94*20,VLOOKUP(E92,warunki2,3,0)))","v":0},{"$f":"IF(R92=\"n.d.\",-1,IF(R92=\"nawiew\",0,IF(R92=\"wywiew\",1,IF(R92=\"naw.wyw.\",0.5,2))))","v":-1},0,"m3/h"]
[{"$nulls":4},"Ilość osób",{"$f":"IF(R92<>\"nawiew\",\"n.d.\",\"\")","v":"n.d."},0,null,null,"[m2]",null,"[m]",null,"[m3]",null,"min. m3/h",{"$f":"N93","v":{"v":16.200000000000003,"d":"16"}}]
[]
[]
[]
[null,null,"0.12",{"$nulls":6},"Powierzchnia",null,"Wysokość",null,"Kubatura",null,"Ruch powietrza",null,{"$f":"IF(E98=\"\",\"n.d.\",VLOOKUP(E98,lista_pod_rodzaj_ruchu_powietrza,4,0))","v":"n.d."},null,{"$f":"IF(Q99>S99,0,1)","v":1}]
[{"$nulls":9},3,null,2.7,null,{"$f":"L99*J99","v":{"v":8.100000000000001,"d":"8.10"}},null,"norma m3/h",{"$f":"IF(R98=\"n.d.\",0,IF(R98=\"nawiew\",G100*20,VLOOKUP(E98,warunki2,3,0)))","v":0},{"$f":"IF(R98=\"n.d.\",-1,IF(R98=\"nawiew\",0,IF(R98=\"wywiew\",1,IF(R98=\"naw.wyw.\",0.5,2))))","v":-1},0,"m3/h"]
[{"$nulls":4},"Ilość osób",{"$f":"IF(R98<>\"nawiew\",\"n.d.\",\"\")","v":"n.d."},0,null,null,"[m2]",null,"[m]",null,"[m3]",null,"min. m3/h",{"$f":"N99","v":{"v":8.100000000000001,"d":"8"}}]
{"$rows_empty":16}
[null,null,"Lista wentylowanych pomieszczeń"]
[]
[]
[]
[null,null,"1.1",{"$nulls":6},"Powierzchnia",null,"Wysokość",null,"Kubatura",null,"Ruch powietrza",null,{"$f":"IF(E121=\"\",\"n.d.\",VLOOKUP(E121,lista_pod_rodzaj_ruchu_powietrza,4,0))","v":"n.d."},0,{"$f":"IF(Q122>S122,0,1)","v":1}]
[{"$nulls":11},2.7,null,{"$f":"L122*J122","v":{"v":0,"d":"0.00"}},null,"norma m3/h",{"$f":"IF(R121=\"n.d.\",0,IF(R121=\"nawiew\",G123*20,VLOOKUP(E121,warunki2,3,0)))","v":0},{"$f":"IF(R121=\"n.d.\",-1,IF(R121=\"nawiew\",0,IF(R121=\"wywiew\",1,IF(R121=\"naw.wyw.\",0.5,2))))","v":-1},0,"m3/h"]
[{"$nulls":4},"Ilość osób",{"$f":"IF(R121<>\"nawiew\",\"n.d.\",\"\")","v":"n.d."},0,null,null,"[m2]",null,"[m]",null,"[m3]",null,"min. m3/h",{"$f":"N122","v":0}]
[]
[]
[null,null,"1.2",{"$nulls":6},"Powierzchnia",null,"Wysokość",null,"Kubatura",null,"Ruch powietrza",null,{"$f":"IF(E126=\"\",\"n.d.\",VLOOKUP(E126,lista_pod_rodzaj_ruchu_powietrza,4,0))","v":"n.d."},null,{"$f":"IF(Q127>S127,0,1)","v":1}]
[{"$nulls":9},19.2,null,2.5,null,{"$f":"L127*J127","v":{"v":48,"d":"48.00"}},null,"norma m3/h",{"$f":"IF(R126=\"n.d.\",0,IF(R126=\"nawiew\",G128*20,VLOOKUP(E126,warunki2,3,0)))","v":0},{"$f":"IF(R126=\"n.d.\",-1,IF(R126=\"nawiew\",0,IF(R126=\"wywiew\",1,IF(R126=\"naw.wyw.\",0.5,2))))","v":-1},0,"m3/h"]
[{"$nulls":4},"Ilość osób",{"$f":"IF(R126<>\"nawiew\",\"n.d.\",\"\")","v":"n.d."},0,null,null,"[m2]",null,"[m]",null,"[m3]",null,"min. m3/h",{"$f":"N127","v":48}]
[]
[]
[]
[null,null,"1.3",{"$nulls":6},"Powierzchnia",null,"Wysokość",null,"Kubatura",null,"Ruch powietrza",null,{"$f":"IF(E132=\"\",\"n.d.\",VLOOKUP(E132,lista_pod_rodzaj_ruchu_powietrza,4,0))","v":"n.d."},null,{"$f":"IF(Q133>S133,0,1)","v":1}]
[{"$nulls":9},4.36,null,2.5,null,{"$f":"L133*J133","v":{"v":10.9,"d":"10.90"}},null,"norma m3/h",{"$f":"IF(R132=\"n.d.\",0,IF(R132=\"nawiew\",G134*20,VLOOKUP(E132,warunki2,3,0)))","v":0},{"$f":"IF(R132=\"n.d.\",-1,IF(R132=\"nawiew\",0,IF(R132=\"wywiew\",1,IF(R132=\"naw.wyw.\",0.5,2))))","v":-1},0,"m3/h"]
[{"$nulls":4},"Ilość osób",{"$f":"IF(R132<>\"nawiew\",\"n.d.\",\"\")","v":"n.d."},0,null,null,"[m2]",null,"[m]",null,"[m3]",null,"min. m3/h",{"$f":"N133","v":{"v":10.9,"d":"11"}}]
[]
[]
[]
[null,null,"1.4",{"$nulls":6},"Powierzchnia",null,"Wysokość",null,"Kubatura",null,"Ruch powietrza",null,{"$f":"IF(E138=\"\",\"n.d.\",VLOOKUP(E138,lista_pod_rodzaj_ruchu_powietrza,4,0))","v":"n.d."},null,{"$f":"IF(Q139>S139,0,1)","v":1}]
[{"$nulls":9},15.62,null,2.5,null,{"$f":"L139*J139","v":39.05},null,"norma m3/h",{"$f":"IF(R138=\"n.d.\",0,IF(R138=\"nawiew\",G140*20,VLOOKUP(E138,warunki2,3,0)))","v":0},{"$f":"IF(R138=\"n.d.\",-1,IF(R138=\"nawiew\",0,IF(R138=\"wywiew\",1,IF(R138=\"naw.wyw.\",0.5,2))))","v":-1},0,"m3/h"]
[{"$nulls":4},"Ilość osób",{"$f":"IF(R138<>\"nawiew\",\"n.d.\",\"\")","v":"n.d."},0,null,null,"[m2]",null,"[m]",null,"[m3]",null,"min. m3/h",{"$f":"N139","v":{"v":39.05,"d":"39"}}]
[]
[]
[]
[null,null,"1.5",{"$nulls":6},"Powierzchnia",null,"Wysokość",null,"Kubatura",null,"Ruch powietrza",null,{"$f":"IF(E144=\"\",\"n.d.\",VLOOKUP(E144,lista_pod_rodzaj_ruchu_powietrza,4,0))","v":"n.d."},null,{"$f":"IF(Q145>S145,0,1)","v":1}]
[{"$nulls":4},"19. Pokój",{"$nulls":4},27.22,null,2.5,null,{"$f":"L145*J145","v":68.05},null,"norma m3/h",{"$f":"IF(R144=\"n.d.\",0,IF(R144=\"nawiew\",G146*20,VLOOKUP(E144,warunki2,3,0)))","v":0},{"$f":"IF(R144=\"n.d.\",-1,IF(R144=\"nawiew\",0,IF(R144=\"wywiew\",1,IF(R144=\"naw.wyw.\",0.5,2))))","v":-1},0,"m3/h"]
[{"$nulls":4},"Ilość osób",{"$f":"IF(R144<>\"nawiew\",\"n.d.\",\"\")","v":"n.d."},0,null,null,"[m2]",null,"[m]",null,"[m3]",null,"min. m3/h",{"$f":"N145","v":{"v":68.05,"d":"68"}}]
[]
[]
[]
[null,null,"1.6",{"$nulls":6},"Powierzchnia",null,"Wysokość",null,"Kubatura",null,"Ruch powietrza",null,{"$f":"IF(E150=\"\",\"n.d.\",VLOOKUP(E150,lista_pod_rodzaj_ruchu_powietrza,4,0))","v":"n.d."},null,{"$f":"IF(Q151>S151,0,1)","v":1}]
[{"$nulls":4},"Nazwa pomieszczenia",{"$nulls":4},{"$f":"0","v":0},null,2.7,null,{"$f":"L151*J151","v":{"v":0,"d":"0.00"}},null,"norma m3/h",{"$f":"IF(R150=\"n.d.\",0,IF(R150=\"nawiew\",G152*20,VLOOKUP(E150,warunki2,3,0)))","v":0},{"$f":"IF(R150=\"n.d.\",-1,IF(R150=\"nawiew\",0,IF(R150=\"wywiew\",1,IF(R150=\"naw.wyw.\",0.5,2))))","v":-1},{"$f":"Q151","v":0},"m3/h"]
[{"$nulls":4},"Ilość osób",{"$f":"IF(R150<>\"nawiew\",\"n.d.\",\"\")","v":"n.d."},0,null,null,"[m2]",null,"[m]",null,"[m3]",null,"min. m3/h",{"$f":"N151","v":0}]
[]
[]
[]
[null,null,"1.7",{"$nulls":6},"Powierzchnia",null,"Wysokość",null,"Kubatura",null,"Ruch powietrza",null,{"$f":"IF(E156=\"\",\"n.d.\",VLOOKUP(E156,lista_pod_rodzaj_ruchu_powietrza,4,0))","v":"n.d."},null,{"$f":"IF(Q157>S157,0,1)","v":1}]
[{"$nulls":4},"Nazwa pomieszczenia",{"$nulls":4},{"$f":"0","v":0},null,2.75,null,{"$f":"L157*J157","v":{"v":0,"d":"0.00"}},null,"norma m3/h",{"$f":"IF(R156=\"n.d.\",0,IF(R156=\"nawiew\",G158*20,VLOOKUP(E156,warunki2,3,0)))","v":0},{"$f":"IF(R156=\"n.d.\",-1,IF(R156=\"nawiew\",0,IF(R156=\"wywiew\",1,IF(R156=\"naw.wyw.\",0.5,2))))","v":-1},{"$f":"Q157","v":0},"m3/h"]
[{"$nulls":4},"Ilość osób",{"$f":"IF(R156<>\"nawiew\",\"n.d.\",\"\")","v":"n.d."},0,null,null,"[m2]",null,"[m]",null,"[m3]",null,"min. m3/h",{"$f":"N157","v":0}]
[]
[]
[]
[null,null,"1.8",{"$nulls":6},"Powierzchnia",null,"Wysokość",null,"Kubatura",null,"Ruch powietrza",null,{"$f":"IF(E162=\"\",\"n.d.\",VLOOKUP(E162,lista_pod_rodzaj_ruchu_powietrza,4,0))","v":"n.d."},null,{"$f":"IF(Q163>S163,0,1)","v":1}]
[{"$nulls":4},"Nazwa pomieszczenia",{"$nulls":4},{"$f":"0","v":0},null,2.7,null,{"$f":"L163*J163","v":{"v":0,"d":"0.00"}},null,"norma m3/h",{"$f":"IF(R162=\"n.d.\",0,IF(R162=\"nawiew\",G164*20,VLOOKUP(E162,warunki2,3,0)))","v":0},{"$f":"IF(R162=\"n.d.\",-1,IF(R162=\"nawiew\",0,IF(R162=\"wywiew\",1,IF(R162=\"naw.wyw.\",0.5,2))))","v":-1},{"$f":"Q163","v":0},"m3/h"]
[{"$nulls":4},"Ilość osób",{"$f":"IF(R162<>\"nawiew\",\"n.d.\",\"\")","v":"n.d."},0,null,null,"[m2]",null,"[m]",null,"[m3]",null,"min. m3/h",{"$f":"N163","v":0}]
[]
[]
[]
[]
[]
[null,null,"Zestawienie danych"]
[]
[]
[]
[{"$nulls":3},"BUDYNEK podsumowanie",{"$nulls":8},"Ruch powietrza"]
[]
[]
[null,null,"Łączna powierzchnia wentylowana",{"$nulls":4},{"$f":"Obliczenia!G30","v":84.83000000000001},"[m2]",null,null,"Strumień powietrza nawiewanego do pomieszczeń",{"$nulls":5},{"$f":"Obliczenia!N30","v":200},"[m3/h]"]
[]
[null,null,"Wprowadzona wentylowana powierzchnia budynku",{"$nulls":4},{"$f":"H17","v":85},"[m2]",null,null,"Strumień powietrza wywiewanego z pomieszczeń",{"$nulls":5},{"$f":"Obliczenia!P30","v":200},"[m3/h]"]
[]
[]
[null,null,"Różnica",{"$nulls":4},{"$f":"H177-H179","v":-0.1699999999999875},"[m2]",null,null,"Szacowana krotność wymiany powietrza",{"$nulls":5},{"$f":"IF(H186=0,\"\",R177/H184)","v":{"v":0.662962913854599,"d":"0.66"}},"[1/h]"]
[]
[null,null,"Łączna kubatura wentylowana",{"$nulls":4},{"$f":"Obliczenia!I30","v":{"v":301.676,"d":"302"}},"[m3]"]
[]
[null,null,"Ilość wentylowanych pomieszczeń",{"$nulls":4},{"$f":"Obliczenia!D20+Obliczenia!D29","v":7}]
[]
[]
[]
[]
[]
[]
[null,null,"Bilans energetyczny i analiza ekonomiczna"]
[]
[]
[]
[{"$nulls":3},"Bilans energetyczny"]
[]
[]
[null,null,"Energia cieplna wymagana dla wentylacji grawitacyjnej\n(obliczenia dla poprawnie pracującej wentylacji)",{"$nulls":4},{"$f":"INT(Obliczenia!C99)","v":4477},"[kWh termiczna ]",null,"Energia cieplna i elektryczna wymagana dla wentylacji mechanicznej z odzyskiem ciepła",{"$nulls":5},{"$f":"INT(Obliczenia!B110)","v":297},"[kWh termiczna ]"]
[{"$nulls":16},{"$f":"INT(Obliczenia!G123)+INT(Obliczenia!G116)","v":822},"[kWh elektryczna ]"]
[]
[]
[{"$nulls":3},"Energia cieplna utracona w wyniku niekontrolowanej wymiany powietrza",{"$nulls":7},"Energia elektryczna zużywana przez centralę wentylacyjną"]
[]
[{"$nulls":4},{"$f":"INT(Obliczenia!C99)&\" [kWh]\"","v":"4477 [kWh]"}]
[{"$nulls":5},"Koszt utraconej energii",{"$nulls":5},{"$f":"INT(Obliczenia!G116)&\" [kWh]\"","v":"413 [kWh]"},{"$nulls":3},"Koszt pracy centrali"]
[{"$nulls":5},"Gaz ziemny",null,{"$f":"INT(Obliczenia!$C$99)*Warunki!C32","v":{"v":1522.18,"d":"1,522.18 zł"}},{"$nulls":7},"Gaz ziemny",null,{"$f":"(INT(Obliczenia!$G$123)+INT(Obliczenia!$G$116))*Warunki!$C$34+INT(Obliczenia!$B$110)*Warunki!C32","v":{"v":964.08,"d":"964.08 zł"}}]
[{"$nulls":5},"Gaz płynny",null,{"$f":"INT(Obliczenia!$C$99)*Warunki!C33","v":{"v":2417.5800000000004,"d":"2,417.58 zł"}},{"$nulls":7},"Gaz ziemny",null,{"$f":"(INT(Obliczenia!$G$123)+INT(Obliczenia!$G$116))*Warunki!$C$34+INT(Obliczenia!$B$110)*Warunki!C33","v":{"v":1023.48,"d":"1,023.48 zł"}}]
[{"$nulls":5},"Pompa ciepła AW",null,{"$f":"INT(Obliczenia!$C$99)*Warunki!C34/3.7","v":{"v":1270.5,"d":"1,270.50 zł"}},{"$nulls":7},"Pompa ciepła AW",null,{"$f":"(INT(Obliczenia!$G$123)+INT(Obliczenia!$G$116))*Warunki!$C$34+INT(Obliczenia!$B$110)*Warunki!C34/3.7","v":{"v":947.3837837837838,"d":"947.38 zł"}}]
[{"$nulls":5},"Pompa ciepła BW",null,{"$f":"INT(Obliczenia!$C$99)*Warunki!C34/4.4","v":{"v":1068.375,"d":"1,068.38 zł"}},null,{"$f":"INT(Obliczenia!G123)&\" [kWh]\"","v":"409 [kWh]"},{"$nulls":3},{"$f":"INT(Obliczenia!B110)&\" [kWh]\"","v":"297 [kWh]"},null,"Pompa ciepła BW",null,{"$f":"(INT(Obliczenia!$G$123)+INT(Obliczenia!$G$116))*Warunki!$C$34+INT(Obliczenia!$B$110)*Warunki!C35/4.4","v":{"v":863.1,"d":"863.10 zł"}}]
[]
[{"$nulls":3},"     wentylacja naturalna",{"$nulls":5},"Energia elektryczna zużywana przez nagrzewnicą wstępną",null,"wentylacja mechaniczna",null,"Energia cieplna utracona wynikająca ze sprawnoości centrali wentylacyjnej"]
[]
[]
[]
[]
[null,null,"Informacje dodatkowe"]
{"$rows_empty":10}
[null,null,"Inwestor",{"$nulls":9},"Partner Viessmann"]
[]
[null,null,"Adres inwestycji"]
{"$rows_empty":7}
[null,null,"Arkusz kalkulacyjny nie może zastąpić fachowego projektu instalacji wentylacji mechanicznej wykonanego przez projektanta z odpowiednimi uprawnieniami.\nAutor arkusza kalkulacyjnego nie ponosi odpowiedzialności za błędy ukryte w arkuszu, oraz za wszelkie negatywne skutki i straty wynikające z jego użytkowania. "]
[]
[{"$nulls":18},"Autor:","PanD, 2023"]

{"sheet":"System DN63","index":1,"n_rows":255,"n_cols":60,"rows_kept":255,"merged":[[0,37,0,38],[2,35,3,35],[2,36,3,37],[2,38,3,46],[7,2,8,35],[10,2,11,28],[16,25,16,29],[16,31,16,35],[18,24,19,24],[18,36,19,36],[19,26,20,27],[19,28,20,28],[19,29,20,29],[19,32,20,33],[19,34,20,34],[19,35,20,35],[25,24,26,24],[25,36,26,36],[26,26,27,27],[26,28,27,28],[26,29,27,29],[26,32,27,33],[26,34,27,34],[26,35,27,35],[32,24,33,24],[32,36,33,36],[33,26,34,27],[33,28,34,28],[33,29,34,29],[33,32,34,33],[33,34,34,34],[33,35,34,35],[39,24,40,24],[39,36,40,36],[40,26,41,27],[40,28,41,28],[40,29,41,29],[40,32,41,33],[40,34,41,34],[40,35,41,35],[46,24,47,24],[46,36,47,36],[47,26,48,27],[47,28,48,28],[47,29,48,29],[47,32,48,33],[47,34,48,34],[47,35,48,35],[53,24,54,24],[53,36,54,36],[54,26,55,27],[54,28,55,28],[54,29,55,29],[54,32,55,33],[54,34,55,34],[54,35,55,35],[60,24,61,24],[60,36,61,36],[61,26,62,27],[61,28,62,28],[61,29,62,29],[61,32,62,33],[61,34,62,34],[61,35,62,35],[67,24,68,24],[67,36,68,36],[68,26,69,27],[68,28,69,28],[68,29,69,29],[68,32,69,33],[68,34,69,34],[68,35,69,35],[74,24,75,24],[74,36,75,36],[75,26,76,27],[75,28,76,28],[75,29,76,29],[75,32,76,33],[75,34,76,34],[75,35,76,35],[81,24,82,24],[81,36,82,36],[82,26,83,27],[82,28,83,28],[82,29,83,29],[82,32,83,33],[82,34,83,34],[82,35,83,35],[87,4,87,20],[87,42,87,58],[88,4,88,19],[88,38,88,40],[88,42,88,58],[89,4,89,20],[89,34,89,40],[89,42,89,58],[90,24,91,24],[90,36,91,36],[91,26,92,27],[91,28,92,28],[91,29,92,29],[91,32,92,33],[91,34,92,34],[91,35,92,35],[97,24,98,24],[97,36,98,36],[98,26,99,27],[98,28,99,28],[98,29,99,29],[98,32,99,33],[98,34,99,34],[98,35,99,35],[104,24,105,24],[104,36,105,36],[105,26,106,27],[105,28,106,28],[105,29,106,29],[105,32,106,33],[105,34,106,34],[105,35,106,35],[111,24,112,24],[111,36,112,36],[112,26,113,27],[112,28,113,28],[112,29,113,29],[112,32,113,33],[112,34,113,34],[112,35,113,35],[118,28,118,33],[127,2,128,39],[132,22,133,25],[136,10,138,22],[136,23,136,27],[136,29,136,30],[144,23,144,27],[144,29,144,30],[148,22,149,27],[153,10,158,22],[153,23,153,27],[153,29,153,30],[154,32,155,32],[154,35,154,36],[156,34,156,35],[157,23,157,27],[157,29,157,30],[160,35,160,36],[161,22,163,28],[162,36,162,37],[166,28,167,28],[166,29,166,30],[166,37,167,37],[166,38,166,39],[171,28,172,28],[171,29,171,30],[171,37,172,37],[171,38,171,39],[176,28,177,28],[176,29,176,30],[176,37,177,37],[176,38,176,39],[181,28,182,28],[181,29,181,30],[186,22,187,28],[190,28,191,28],[190,29,190,30],[190,37,191,37],[190,38,190,39],[195,28,196,28],[195,29,195,30],[195,37,196,37],[195,38,195,39],[200,28,201,28],[200,29,200,30],[205,22,206,26],[209,28,210,28],[209,29,209,30],[209,37,210,37],[209,38,209,39],[214,2,214,5],[214,28,215,28],[214,29,214,30],[214,37,215,37],[214,38,214,39],[219,28,220,28],[219,29,219,30],[219,37,220,37],[219,38,219,39],[224,28,225,28],[224,29,224,30],[224,37,225,37],[224,38,224,39],[234,36,234,37]]}
[{"$nulls":28},"R system",{"$f":"AM236/100","v":{"v":0.05,"d":"5%"}},null,null,"R centrala",{"$f":"AC138/100","v":{"v":0.05,"d":"5%"}},null,null,"Suma",{"$f":"AK235","v":{"v":24792.809999999994,"d":"24,792.81 zł"}}]
[]
[{"$nulls":35},"Data:   ",{"$f":"TODAY()","v":"2023-10-25"},null,{"$f":"Dane!S3","v":"wersja 23/10/2023"}]
[]
[]
[]
[]
[null,null,"System dystrybucji powietrza  |  okrągły Φ63"]
[]
[]
[null,null,"Uproszczony schemat instalacji"]
[]
[]
[]
[]
[]
[{"$nulls":25},"Powietrze wywiewane",{"$nulls":5},"Powietrze nawiewane"]
[]
[{"$nulls":24},{"$f":"IF(Obliczenia!E61=\"10\",\"\",Obliczenia!E61)","v":"0.1"},{"$nulls":11},{"$f":"IF(Obliczenia!E37=\"10\",\"\",Obliczenia!E37)","v":"0.5"}]
[{"$nulls":23},{"$f":"IF(Y19<>\"\",\"1\",\"\")","v":"1"},null,null,{"$f":"IF(Y19=\"\",\"\",VLOOKUP(Y19,big_tabela,3,0))","v":"Wiatrołap"},null,{"$f":"IF(Y19=\"\",\"\",VLOOKUP(Y19,big_tabela,12,0))","v":25},"m3/h",null,null,{"$f":"IF(AK19=\"\",\"\",VLOOKUP(AK19,big_tabela,3,0))","v":"Salon"},null,{"$f":"IF(AK19=\"\",\"\",VLOOKUP(AK19,big_tabela,12,0))","v":120},"m3/h",null,{"$f":"IF(AK19<>\"\",\"1\",\"\")","v":"1"}]
[{"$nulls":22},{"$f":"IF(Y19=\"\",\"\",\"Φ63\")","v":"Φ63"},{"$f":"IF(Y19=\"\",\"\",\"x\"&VLOOKUP(Y19,big_tabela,20,0))","v":"x1"},{"$f":"IF(Y19=\"\",\"\",\"◄\")","v":"◄"},{"$nulls":11},{"$f":"IF(AK19=\"\",\"\",\"◄\")","v":"◄"},{"$f":"IF(AK19=\"\",\"\",\"Φ63\")","v":"Φ63"},{"$f":"IF(AK19=\"\",\"\",\"x\"&VLOOKUP(AK19,big_tabela,19,0))","v":"x5"}]
[{"$nulls":3},{"$f":"$X$20","v":"1"},{"$f":"$X$20","v":"1"},{"$f":"$X$20","v":"1"},"1","1","1","1","1","1","1","1","1","1","1","1","1","1","1","1","1","1","1",{"$nulls":11},{"$f":"$AL$20","v":"1"},{"$f":"$AL$20","v":"1"},"1","1","1","1","1","1","1","1","1","1","1","1","1","1","1","1","1","1","1","1","1","1"]
[{"$nulls":3},{"$f":"$X$20","v":"1"},{"$nulls":22},{"$f":"IF(Y19=\"\",\"\",VLOOKUP(Y19,big_tabela,4,0))","v":"0.1 Wiatrołap"},null,{"$f":"IF(Y19=\"\",\"\",\"anemostat\")","v":"anemostat"},{"$f":"IF(Y19=\"\",\"\",\"x\"&VLOOKUP(Y19,big_tabela,23,0))","v":"x1"},null,null,{"$f":"IF(AK19=\"\",\"\",VLOOKUP(AK19,big_tabela,4,0))","v":"0.6 Salon"},null,{"$f":"IF(AK19=\"\",\"\",\"anemostat\")","v":"anemostat"},{"$f":"IF(AK19=\"\",\"\",\"x\"&VLOOKUP(AK19,big_tabela,22,0))","v":"x2"},{"$nulls":23},"1"]
[{"$nulls":3},"1",{"$nulls":55},"1"]
[{"$nulls":3},"1",{"$nulls":55},"1"]
[{"$nulls":3},"1",{"$nulls":20},{"$f":"IF(Obliczenia!E62=\"10\",\"\",Obliczenia!E62)","v":"0.6"},{"$nulls":11},{"$f":"IF(Obliczenia!E38=\"10\",\"\",Obliczenia!E38)","v":"0.4"},{"$nulls":22},"1"]
[{"$nulls":3},"1",{"$nulls":19},{"$f":"IF(Y26<>\"\",\"1\",\"\")","v":"1"},null,null,{"$f":"IF(Y26=\"\",\"\",VLOOKUP(Y26,big_tabela,3,0))","v":"Spiżarnia"},null,{"$f":"IF(Y26=\"\",\"\",VLOOKUP(Y26,big_tabela,12,0))","v":25},"m3/h",null,null,{"$f":"IF(AK26=\"\",\"\",VLOOKUP(AK26,big_tabela,3,0))","v":"Jadalnia - nawiew"},null,{"$f":"IF(AK26=\"\",\"\",VLOOKUP(AK26,big_tabela,12,0))","v":80},"m3/h",null,{"$f":"IF(AK26<>\"\",\"1\",\"\")","v":"1"},{"$nulls":21},"1"]
[{"$nulls":3},"1",{"$nulls":18},{"$f":"IF(Y26=\"\",\"\",\"Φ63\")","v":"Φ63"},{"$f":"IF(Y26=\"\",\"\",\"x\"&VLOOKUP(Y26,big_tabela,20,0))","v":"x1"},{"$f":"IF(Y26=\"\",\"\",\"◄\")","v":"◄"},{"$nulls":11},{"$f":"IF(AK26=\"\",\"\",\"◄\")","v":"◄"},{"$f":"IF(AK26=\"\",\"\",\"Φ63\")","v":"Φ63"},{"$f":"IF(AK26=\"\",\"\",\"x\"&VLOOKUP(AK26,big_tabela,19,0))","v":"x4"},{"$nulls":20},"1"]
[{"$nulls":3},"1",null,{"$f":"$X$27","v":"1"},"1","1","1","1","1","1","1","1","1","1","1","1","1","1","1","1","1","1",{"$f":"$X$27","v":"1"},{"$nulls":11},{"$f":"$AL$27","v":"1"},{"$f":"$AL$27","v":"1"},"1","1","1","1","1","1","1","1","1","1","1","1","1","1","1","1","1","1","1","1",null,"1"]
[{"$nulls":3},"1",null,"1",{"$nulls":20},{"$f":"IF(Y26=\"\",\"\",VLOOKUP(Y26,big_tabela,4,0))","v":"04.a Spiżarnia"},null,{"$f":"IF(Y26=\"\",\"\",\"anemostat\")","v":"anemostat"},{"$f":"IF(Y26=\"\",\"\",\"x\"&VLOOKUP(Y26,big_tabela,23,0))","v":"x1"},null,null,{"$f":"IF(AK26=\"\",\"\",VLOOKUP(AK26,big_tabela,4,0))","v":"0.5 Jadalnia"},null,{"$f":"IF(AK26=\"\",\"\",\"anemostat\")","v":"anemostat"},{"$f":"IF(AK26=\"\",\"\",\"x\"&VLOOKUP(AK26,big_tabela,22,0))","v":"x2"},{"$nulls":21},"1",null,"1"]
[{"$nulls":3},"1",null,"1",{"$nulls":51},"1",null,"1"]
[{"$nulls":3},"1",null,"1",{"$nulls":51},"1",null,"1"]
[{"$nulls":3},"1",null,"1",{"$nulls":18},{"$f":"IF(Obliczenia!E63=\"10\",\"\",Obliczenia!E63)","v":"0.2"},{"$nulls":11},{"$f":"IF(Obliczenia!E39=\"10\",\"\",Obliczenia!E39)","v":""},{"$nulls":20},"1",null,"1"]
[{"$nulls":3},"1",null,"1",1,{"$nulls":16},{"$f":"IF(Y33<>\"\",\"1\",\"\")","v":"1"},null,null,{"$f":"IF(Y33=\"\",\"\",VLOOKUP(Y33,big_tabela,3,0))","v":"Łazienka"},null,{"$f":"IF(Y33=\"\",\"\",VLOOKUP(Y33,big_tabela,12,0))","v":75},"m3/h",null,null,{"$f":"IF(AK33=\"\",\"\",VLOOKUP(AK33,big_tabela,3,0))","v":""},null,{"$f":"IF(AK33=\"\",\"\",VLOOKUP(AK33,big_tabela,12,0))","v":""},"m3/h",null,{"$f":"IF(AK33<>\"\",\"1\",\"\")","v":""},{"$nulls":19},"1",null,"1"]
[{"$nulls":3},"1",null,"1",{"$nulls":16},{"$f":"IF(Y33=\"\",\"\",\"Φ63\")","v":"Φ63"},{"$f":"IF(Y33=\"\",\"\",\"x\"&VLOOKUP(Y33,big_tabela,20,0))","v":"x3"},{"$f":"IF(Y33=\"\",\"\",\"◄\")","v":"◄"},{"$nulls":11},{"$f":"IF(AK33=\"\",\"\",\"◄\")","v":""},{"$f":"IF(AK33=\"\",\"\",\"Φ63\")","v":""},{"$f":"IF(AK33=\"\",\"\",\"x\"&VLOOKUP(AK33,big_tabela,19,0))","v":""},{"$nulls":18},"1",null,"1"]
[{"$nulls":3},"1",null,"1",null,{"$f":"$X$34","v":"1"},{"$f":"$X$34","v":"1"},"1","1","1","1","1","1","1","1","1","1","1","1","1","1","1",{"$f":"$X$34","v":"1"},{"$nulls":11},{"$f":"$AL$34","v":""},{"$f":"$AL$34","v":""},"","","","","","","","","","","","","","","","","","",null,"1",null,"1"]
[{"$nulls":3},"1",null,"1",null,"1",{"$nulls":18},{"$f":"IF(Y33=\"\",\"\",VLOOKUP(Y33,big_tabela,4,0))","v":"03. Łazienka"},null,{"$f":"IF(Y33=\"\",\"\",\"anemostat\")","v":"anemostat"},{"$f":"IF(Y33=\"\",\"\",\"x\"&VLOOKUP(Y33,big_tabela,23,0))","v":"x1"},null,null,{"$f":"IF(AK33=\"\",\"\",VLOOKUP(AK33,big_tabela,4,0))","v":""},null,{"$f":"IF(AK33=\"\",\"\",\"anemostat\")","v":""},{"$f":"IF(AK33=\"\",\"\",\"x\"&VLOOKUP(AK33,big_tabela,22,0))","v":""},{"$nulls":19},"",null,"1",null,"1"]
[{"$nulls":3},"1",null,"1",null,"1",{"$nulls":47},"",null,"1",null,{"$f":"$AL$20","v":"1"}]
[{"$nulls":3},"1",null,"1",null,"1",{"$nulls":47},"",null,"1",null,"1"]
[{"$nulls":3},"1",null,"1",null,"1",{"$nulls":16},{"$f":"IF(Obliczenia!E64=\"10\",\"\",Obliczenia!E64)","v":"0.3"},{"$nulls":11},{"$f":"IF(Obliczenia!E40=\"10\",\"\",Obliczenia!E40)","v":""},{"$nulls":18},"",null,"1",null,"1"]
[{"$nulls":3},"1",null,"1",null,"1",{"$nulls":15},{"$f":"IF(Y40<>\"\",\"1\",\"\")","v":"1"},null,null,{"$f":"IF(Y40=\"\",\"\",VLOOKUP(Y40,big_tabela,3,0))","v":"Kuchnia otwarta z kuchenką elektryczną"},null,{"$f":"IF(Y40=\"\",\"\",VLOOKUP(Y40,big_tabela,12,0))","v":75},"m3/h",null,null,{"$f":"IF(AK40=\"\",\"\",VLOOKUP(AK40,big_tabela,3,0))","v":""},null,{"$f":"IF(AK40=\"\",\"\",VLOOKUP(AK40,big_tabela,12,0))","v":""},"m3/h",null,{"$f":"IF(AK40<>\"\",\"1\",\"\")","v":""},{"$nulls":17},"",null,"1",null,"1"]
[{"$nulls":3},"1",null,"1",null,"1",{"$nulls":14},{"$f":"IF(Y40=\"\",\"\",\"Φ63\")","v":"Φ63"},{"$f":"IF(Y40=\"\",\"\",\"x\"&VLOOKUP(Y40,big_tabela,20,0))","v":"x3"},{"$f":"IF(Y40=\"\",\"\",\"◄\")","v":"◄"},{"$nulls":11},{"$f":"IF(AK40=\"\",\"\",\"◄\")","v":""},{"$f":"IF(AK40=\"\",\"\",\"Φ63\")","v":""},{"$f":"IF(AK40=\"\",\"\",\"x\"&VLOOKUP(AK40,big_tabela,19,0))","v":""},{"$nulls":16},"",null,"1",null,"1"]
[{"$nulls":3},"1",null,"1",null,"1",null,{"$f":"$X$41","v":"1"},"1","1","1","1","1","1","1","1","1","1","1","1","1","1",{"$f":"$X$41","v":"1"},{"$nulls":11},{"$f":"$AL$41","v":""},{"$f":"$AL$41","v":""},"","","","","","","","","","","","","","","","",null,"",null,"1",null,"1"]
[{"$nulls":3},"1",null,"1",null,"1",null,"1",{"$nulls":16},{"$f":"IF(Y40=\"\",\"\",VLOOKUP(Y40,big_tabela,4,0))","v":"04. Kuchnia"},null,{"$f":"IF(Y40=\"\",\"\",\"anemostat\")","v":"anemostat"},{"$f":"IF(Y40=\"\",\"\",\"x\"&VLOOKUP(Y40,big_tabela,23,0))","v":"x1"},null,null,{"$f":"IF(AK40=\"\",\"\",VLOOKUP(AK40,big_tabela,4,0))","v":""},null,{"$f":"IF(AK40=\"\",\"\",\"anemostat\")","v":""},{"$f":"IF(AK40=\"\",\"\",\"x\"&VLOOKUP(AK40,big_tabela,22,0))","v":""},{"$nulls":17},"",null,"",null,"1",null,"1"]
[{"$nulls":3},"1",null,{"$f":"$X$27","v":"1"},null,"1",null,"1",{"$nulls":43},"",null,"",null,{"$f":"$AL$27","v":"1"},null,"1"]
[{"$nulls":3},"1",null,"1",null,"1",null,"1",{"$nulls":43},"",null,"",null,"1",null,"1"]
[{"$nulls":3},"1",null,"1",null,"1",null,"1",{"$nulls":14},{"$f":"IF(Obliczenia!E65=\"10\",\"\",Obliczenia!E65)","v":""},{"$nulls":11},{"$f":"IF(Obliczenia!E41=\"10\",\"\",Obliczenia!E41)","v":""},{"$nulls":16},"",null,"",null,"1",null,"1"]
[{"$nulls":3},"1",null,"1",null,"1",null,"1",{"$nulls":13},{"$f":"IF(Y47<>\"\",\"1\",\"\")","v":""},null,null,{"$f":"IF(Y47=\"\",\"\",VLOOKUP(Y47,big_tabela,3,0))","v":""},null,{"$f":"IF(Y47=\"\",\"\",VLOOKUP(Y47,big_tabela,12,0))","v":""},"m3/h",null,null,{"$f":"IF(AK47=\"\",\"\",VLOOKUP(AK47,big_tabela,3,0))","v":""},null,{"$f":"IF(AK47=\"\",\"\",VLOOKUP(AK47,big_tabela,12,0))","v":""},"m3/h",null,{"$f":"IF(AK47<>\"\",\"1\",\"\")","v":""},{"$nulls":15},"",null,"",null,"1",null,"1"]
[{"$nulls":3},"1",null,"1",null,"1",null,"1",{"$nulls":12},{"$f":"IF(Y47=\"\",\"\",\"Φ63\")","v":""},{"$f":"IF(Y47=\"\",\"\",\"x\"&VLOOKUP(Y47,big_tabela,20,0))","v":""},{"$f":"IF(Y47=\"\",\"\",\"◄\")","v":""},{"$nulls":11},{"$f":"IF(AK47=\"\",\"\",\"◄\")","v":""},{"$f":"IF(AK47=\"\",\"\",\"Φ63\")","v":""},{"$f":"IF(AK47=\"\",\"\",\"x\"&VLOOKUP(AK47,big_tabela,19,0))","v":""},{"$nulls":14},"",null,"",null,"1",null,"1"]
[{"$nulls":3},"1",null,"1",null,"1",null,"1",null,{"$f":"$X$48","v":""},{"$f":"$X$48","v":""},"","","","","","","","","","","",{"$f":"$X$48","v":""},{"$nulls":11},{"$f":"$AL$48","v":""},"","","","","","","","","","","","","","","",null,"",null,"",null,"1",null,"1"]
[{"$nulls":3},"1",null,"1",null,"1",null,"1",null,"",{"$nulls":14},{"$f":"IF(Y47=\"\",\"\",VLOOKUP(Y47,big_tabela,4,0))","v":""},null,{"$f":"IF(Y47=\"\",\"\",\"anemostat\")","v":""},{"$f":"IF(Y47=\"\",\"\",\"x\"&VLOOKUP(Y47,big_tabela,23,0))","v":""},null,null,{"$f":"IF(AK47=\"\",\"\",VLOOKUP(AK47,big_tabela,4,0))","v":""},null,{"$f":"IF(AK47=\"\",\"\",\"anemostat\")","v":""},{"$f":"IF(AK47=\"\",\"\",\"x\"&VLOOKUP(AK47,big_tabela,22,0))","v":""},{"$nulls":15},{"$f":"$AL$48","v":""},null,"",null,"",null,"1",null,"1"]
[{"$nulls":3},"1",null,"1",null,"1",null,"1",null,"",{"$nulls":39},"",null,"",null,{"$f":"$AL$34","v":""},null,"1",null,"1"]
[{"$nulls":3},"1",null,"1",null,"1",null,"1",null,"",{"$nulls":39},"",null,"",null,"",null,"1",null,"1"]
[{"$nulls":3},"1",null,"1",null,"1",null,"1",null,"",{"$nulls":12},{"$f":"IF(Obliczenia!E66=\"10\",\"\",Obliczenia!E66)","v":""},{"$nulls":11},{"$f":"IF(Obliczenia!E42=\"10\",\"\",Obliczenia!E42)","v":""},{"$nulls":14},"",null,"",null,"",null,"1",null,"1"]
[{"$nulls":3},"1",null,"1",null,"1",null,"1",null,"",{"$nulls":11},{"$f":"IF(Y54<>\"\",\"1\",\"\")","v":""},null,null,{"$f":"IF(Y54=\"\",\"\",VLOOKUP(Y54,big_tabela,3,0))","v":""},null,{"$f":"IF(Y54=\"\",\"\",VLOOKUP(Y54,big_tabela,12,0))","v":""},"m3/h",null,null,{"$f":"IF(AK54=\"\",\"\",VLOOKUP(AK54,big_tabela,3,0))","v":""},null,{"$f":"IF(AK54=\"\",\"\",VLOOKUP(AK54,big_tabela,12,0))","v":""},"m3/h",null,{"$f":"IF(AK54<>\"\",\"1\",\"\")","v":""},{"$nulls":13},"",null,"",null,"",null,"1",null,"1"]
[{"$nulls":3},"1",null,"1",null,"1",null,"1",null,"",{"$nulls":10},{"$f":"IF(Y54=\"\",\"\",\"Φ63\")","v":""},{"$f":"IF(Y54=\"\",\"\",\"x\"&VLOOKUP(Y54,big_tabela,20,0))","v":""},{"$f":"IF(Y54=\"\",\"\",\"◄\")","v":""},{"$nulls":11},{"$f":"IF(AK54=\"\",\"\",\"◄\")","v":""},{"$f":"IF(AK54=\"\",\"\",\"Φ63\")","v":""},{"$f":"IF(AK54=\"\",\"\",\"x\"&VLOOKUP(AK54,big_tabela,19,0))","v":""},{"$nulls":12},"",null,"",null,"",null,"1",null,"1"]
[{"$nulls":3},"1",null,"1",null,"1",null,"1",null,"",null,{"$f":"$X$55","v":""},{"$f":"$X$55","v":""},"","","","","","","","","",{"$f":"$X$55","v":""},{"$nulls":11},{"$f":"$AL$55","v":""},"","","","","","","","","","","","","",null,"",null,"",null,"",null,"1",null,"1"]
[{"$nulls":3},"1",null,"1",null,"1",null,"1",null,"",null,"",{"$nulls":12},{"$f":"IF(Y54=\"\",\"\",VLOOKUP(Y54,big_tabela,4,0))","v":""},null,{"$f":"IF(Y54=\"\",\"\",\"anemostat\")","v":""},{"$f":"IF(Y54=\"\",\"\",\"x\"&VLOOKUP(Y54,big_tabela,23,0))","v":""},null,null,{"$f":"IF(AK54=\"\",\"\",VLOOKUP(AK54,big_tabela,4,0))","v":""},null,{"$f":"IF(AK54=\"\",\"\",\"anemostat\")","v":""},{"$f":"IF(AK54=\"\",\"\",\"x\"&VLOOKUP(AK54,big_tabela,22,0))","v":""},{"$nulls":13},{"$f":"$AL$55","v":""},null,"",null,"",null,"",null,"1",null,"1"]
[{"$nulls":3},"1",null,"1",null,"1",null,{"$f":"$X$41","v":"1"},null,"",null,"",{"$nulls":35},"",null,"",null,{"$f":"$AL$41","v":""},null,"",null,"1",null,"1"]
[{"$nulls":3},"1",null,"1",null,"1",null,"1",null,"",null,"",{"$nulls":35},"",null,"",null,"",null,"",null,"1",null,"1"]
[{"$nulls":3},"1",null,"1",null,"1",null,"1",null,"",null,"",{"$nulls":10},{"$f":"IF(Obliczenia!E67=\"10\",\"\",Obliczenia!E67)","v":""},{"$nulls":11},{"$f":"IF(Obliczenia!E43=\"10\",\"\",Obliczenia!E43)","v":""},{"$nulls":12},"",null,"",null,"",null,"",null,"1",null,"1"]
[{"$nulls":3},"1",null,"1",null,"1",null,"1",null,"",null,"",{"$nulls":9},{"$f":"IF(Y61<>\"\",\"1\",\"\")","v":""},null,null,{"$f":"IF(Y61=\"\",\"\",VLOOKUP(Y61,big_tabela,3,0))","v":""},null,{"$f":"IF(Y61=\"\",\"\",VLOOKUP(Y61,big_tabela,12,0))","v":""},"m3/h",null,null,{"$f":"IF(AK61=\"\",\"\",VLOOKUP(AK61,big_tabela,3,0))","v":""},null,{"$f":"IF(AK61=\"\",\"\",VLOOKUP(AK61,big_tabela,12,0))","v":""},"m3/h",null,{"$f":"IF(AK61<>\"\",\"1\",\"\")","v":""},{"$nulls":11},"",null,"",null,"",null,"",null,"1",null,"1"]
[{"$nulls":3},"1",null,"1",null,"1",null,"1",null,"",null,"",{"$nulls":8},{"$f":"IF(Y61=\"\",\"\",\"Φ63\")","v":""},{"$f":"IF(Y61=\"\",\"\",\"x\"&VLOOKUP(Y61,big_tabela,20,0))","v":""},{"$f":"IF(Y61=\"\",\"\",\"◄\")","v":""},{"$nulls":11},{"$f":"IF(AK61=\"\",\"\",\"◄\")","v":""},{"$f":"IF(AK61=\"\",\"\",\"Φ63\")","v":""},{"$f":"IF(AK61=\"\",\"\",\"x\"&VLOOKUP(AK61,big_tabela,19,0))","v":""},{"$nulls":10},"",null,"",null,"",null,"",null,"1",null,"1"]
[{"$nulls":3},"1",null,"1",null,"1",null,"1",null,"",null,"",null,{"$f":"$X$62","v":""},{"$f":"$X$62","v":""},"","","","","","","","",{"$nulls":11},{"$f":"$AL$62","v":""},"","","","","","","","","","","",null,"",null,"",null,"",null,"",null,"1",null,"1"]
[{"$nulls":3},"1",null,"1",null,"1",null,"1",null,"",null,"",null,{"$f":"$X$62","v":""},{"$nulls":10},{"$f":"IF(Y61=\"\",\"\",VLOOKUP(Y61,big_tabela,4,0))","v":""},null,{"$f":"IF(Y61=\"\",\"\",\"anemostat\")","v":""},{"$f":"IF(Y61=\"\",\"\",\"x\"&VLOOKUP(Y61,big_tabela,23,0))","v":""},null,null,{"$f":"IF(AK61=\"\",\"\",VLOOKUP(AK61,big_tabela,4,0))","v":""},null,{"$f":"IF(AK61=\"\",\"\",\"anemostat\")","v":""},{"$f":"IF(AK61=\"\",\"\",\"x\"&VLOOKUP(AK61,big_tabela,22,0))","v":""},{"$nulls":11},{"$f":"$AL$62","v":""},null,"",null,"",null,"",null,"",null,"1",null,"1"]
[{"$nulls":3},"1",null,"1",null,"1",null,"1",null,"",null,"",null,"",{"$nulls":31},"",null,"",null,{"$f":"$AL$48","v":""},null,"",null,"",null,"1",null,"1"]
[{"$nulls":3},"1",null,"1",null,"1",null,"1",null,"",null,"",null,"",{"$nulls":31},"",null,"",null,"",null,"",null,"",null,"1",null,"1"]
[{"$nulls":3},"1",null,"1",null,"1",null,"1",null,"",null,"",null,"",{"$nulls":8},{"$f":"IF(Obliczenia!E68=\"10\",\"\",Obliczenia!E68)","v":""},{"$nulls":11},{"$f":"IF(Obliczenia!E44=\"10\",\"\",Obliczenia!E44)","v":""},{"$nulls":10},"",null,"",null,"",null,"",null,"",null,"1",null,"1"]
[{"$nulls":3},"1",null,"1",null,"1",null,"1",null,"",null,"",null,"",{"$nulls":7},{"$f":"IF(Y68<>\"\",\"1\",\"\")","v":""},null,null,{"$f":"IF(Y68=\"\",\"\",VLOOKUP(Y68,big_tabela,3,0))","v":""},null,{"$f":"IF(Y68=\"\",\"\",VLOOKUP(Y68,big_tabela,12,0))","v":""},"m3/h",null,null,{"$f":"IF(AK68=\"\",\"\",VLOOKUP(AK68,big_tabela,3,0))","v":""},null,{"$f":"IF(AK68=\"\",\"\",VLOOKUP(AK68,big_tabela,12,0))","v":""},"m3/h",null,{"$f":"IF(AK68<>\"\",\"1\",\"\")","v":""},{"$nulls":9},"",null,"",null,"",null,"",null,"",null,"1",null,"1"]
[{"$nulls":3},"1",null,"1",null,"1",null,"1",null,"",null,"",null,"",{"$nulls":6},{"$f":"IF(Y68=\"\",\"\",\"Φ63\")","v":""},{"$f":"IF(Y68=\"\",\"\",\"x\"&VLOOKUP(Y68,big_tabela,20,0))","v":""},{"$f":"IF(Y68=\"\",\"\",\"◄\")","v":""},{"$nulls":11},{"$f":"IF(AK68=\"\",\"\",\"◄\")","v":""},{"$f":"IF(AK68=\"\",\"\",\"Φ63\")","v":""},{"$f":"IF(AK68=\"\",\"\",\"x\"&VLOOKUP(AK68,big_tabela,19,0))","v":""},{"$nulls":8},"",null,"",null,"",null,"",null,"",null,"1",null,"1"]
[{"$nulls":3},"1",null,"1",null,"1",null,"1",null,"",null,"",null,"",null,{"$f":"$X$69","v":""},{"$f":"$X$69","v":""},"","","","","",{"$f":"$X$69","v":""},{"$nulls":11},{"$f":"$AL$69","v":""},"","","","","","","","","",null,"",null,"",null,"",null,"",null,"",null,"1",null,"1"]
[{"$nulls":3},"1",null,"1",null,"1",null,"1",null,"",null,"",null,"",null,"",{"$nulls":8},{"$f":"IF(Y68=\"\",\"\",VLOOKUP(Y68,big_tabela,4,0))","v":""},null,{"$f":"IF(Y68=\"\",\"\",\"anemostat\")","v":""},{"$f":"IF(Y68=\"\",\"\",\"x\"&VLOOKUP(Y68,big_tabela,23,0))","v":""},null,null,{"$f":"IF(AK68=\"\",\"\",VLOOKUP(AK68,big_tabela,4,0))","v":""},null,{"$f":"IF(AK68=\"\",\"\",\"anemostat\")","v":""},{"$f":"IF(AK68=\"\",\"\",\"x\"&VLOOKUP(AK68,big_tabela,22,0))","v":""},{"$nulls":9},{"$f":"$AL$69","v":""},null,"",null,"",null,"",null,"",null,"",null,"1",null,"1"]
[{"$nulls":3},"1",null,"1",null,"1",null,"1",null,"",null,"",null,"",null,"",{"$nulls":27},"",null,"",null,{"$f":"$AL$55","v":""},null,"",null,"",null,"",null,"1",null,"1"]
[{"$nulls":3},"1",null,"1",null,"1",null,"1",null,"",null,"",null,"",null,"",{"$nulls":27},"",null,"",null,"",null,"",null,"",null,"",null,"1",null,"1"]
[{"$nulls":3},"1",null,"1",null,"1",null,"1",null,"",null,"",null,"",null,"",{"$nulls":6},{"$f":"IF(Obliczenia!E69=\"10\",\"\",Obliczenia!E69)","v":""},{"$nulls":11},{"$f":"IF(Obliczenia!E45=\"10\",\"\",Obliczenia!E45)","v":""},{"$nulls":8},"",null,"",null,"",null,"",null,"",null,"",null,"1",null,"1"]
[{"$nulls":3},"1",null,"1",null,"1",null,"1",null,"",null,"",null,"",null,"",{"$nulls":5},{"$f":"IF(Y75<>\"\",\"1\",\"\")","v":""},null,null,{"$f":"IF(Y75=\"\",\"\",VLOOKUP(Y75,big_tabela,3,0))","v":""},null,{"$f":"IF(Y75=\"\",\"\",VLOOKUP(Y75,big_tabela,12,0))","v":""},"m3/h",null,null,{"$f":"IF(AK75=\"\",\"\",VLOOKUP(AK75,big_tabela,3,0))","v":""},null,{"$f":"IF(AK75=\"\",\"\",VLOOKUP(AK75,big_tabela,12,0))","v":""},"m3/h",null,{"$f":"IF(AK75<>\"\",\"1\",\"\")","v":""},{"$nulls":7},"",null,"",null,"",null,"",null,"",null,"",null,"1",null,"1"]
[{"$nulls":3},"1",null,"1",null,"1",null,"1",null,"",null,"",null,"",null,"",{"$nulls":4},{"$f":"IF(Y75=\"\",\"\",\"Φ63\")","v":""},{"$f":"IF(Y75=\"\",\"\",\"x\"&VLOOKUP(Y75,big_tabela,20,0))","v":""},{"$f":"IF(Y75=\"\",\"\",\"◄\")","v":""},{"$nulls":11},{"$f":"IF(AK75=\"\",\"\",\"◄\")","v":""},{"$f":"IF(AK75=\"\",\"\",\"Φ63\")","v":""},{"$f":"IF(AK75=\"\",\"\",\"x\"&VLOOKUP(AK75,big_tabela,19,0))","v":""},{"$nulls":6},"",null,"",null,"",null,"",null,"",null,"",null,"1",null,"1"]
[{"$nulls":3},"1",null,"1",null,"1",null,"1",null,"",null,"",null,"",null,"",null,{"$f":"$X$76","v":""},{"$f":"$X$76","v":""},"","","",{"$f":"$X$76","v":""},{"$nulls":11},{"$f":"$AL$76","v":""},{"$f":"$AL$76","v":""},"","","","","","",null,"",null,"",null,"",null,"",null,"",null,"",null,"1",null,"1"]
[{"$nulls":3},"1",null,"1",null,"1",null,"1",null,"",null,"",null,"",null,"",null,"",{"$nulls":6},{"$f":"IF(Y75=\"\",\"\",VLOOKUP(Y75,big_tabela,4,0))","v":""},null,{"$f":"IF(Y75=\"\",\"\",\"anemostat\")","v":""},{"$f":"IF(Y75=\"\",\"\",\"x\"&VLOOKUP(Y75,big_tabela,23,0))","v":""},null,null,{"$f":"IF(AK75=\"\",\"\",VLOOKUP(AK75,big_tabela,4,0))","v":""},null,{"$f":"IF(AK75=\"\",\"\",\"anemostat\")","v":""},{"$f":"IF(AK75=\"\",\"\",\"x\"&VLOOKUP(AK75,big_tabela,22,0))","v":""},{"$nulls":7},"",null,"",null,"",null,"",null,"",null,"",null,"",null,"1",null,"1"]
[{"$nulls":3},"1",null,"1",null,"1",null,"1",null,"",null,"",null,"",null,"",null,"",{"$nulls":23},"",null,"",null,{"$f":"$AL$62","v":""},null,"",null,"",null,"",null,"",null,"1",null,"1"]
[{"$nulls":3},"1",null,"1",null,"1",null,"1",null,"",null,"",null,"",null,"",null,"",{"$nulls":23},"",null,"",null,"",null,"",null,"",null,"",null,"",null,"1",null,"1"]
[{"$nulls":3},"1",null,"1",null,"1",null,"1",null,"",null,"",null,"",null,"",null,"",{"$nulls":4},{"$f":"IF(Obliczenia!E70=\"10\",\"\",Obliczenia!E70)","v":""},{"$nulls":11},{"$f":"IF(Obliczenia!E46=\"10\",\"\",Obliczenia!E46)","v":""},{"$nulls":6},"",null,"",null,"",null,"",null,"",null,"",null,"",null,"1",null,"1"]
[{"$nulls":3},"1",null,"1",null,"1",null,"1",null,"",null,"",null,"",null,"",null,"",{"$nulls":3},{"$f":"IF(Y82<>\"\",\"1\",\"\")","v":""},null,null,{"$f":"IF(Y82=\"\",\"\",VLOOKUP(Y82,big_tabela,3,0))","v":""},null,{"$f":"IF(Y82=\"\",\"\",VLOOKUP(Y82,big_tabela,12,0))","v":""},"m3/h",null,null,{"$f":"IF(AK82=\"\",\"\",VLOOKUP(AK82,big_tabela,3,0))","v":""},null,{"$f":"IF(AK82=\"\",\"\",VLOOKUP(AK82,big_tabela,12,0))","v":""},"m3/h",null,{"$f":"IF(AK82<>\"\",\"1\",\"\")","v":""},{"$nulls":5},"",null,"",null,"",null,"",null,"",null,"",null,"",null,"1",null,"1"]
[{"$nulls":3},"1",null,"1",null,"1",null,"1",null,"",null,"",null,"",null,"",null,"",null,null,{"$f":"IF(Y82=\"\",\"\",\"Φ63\")","v":""},{"$f":"IF(Y82=\"\",\"\",\"x\"&VLOOKUP(Y82,big_tabela,20,0))","v":""},{"$f":"IF(Y82=\"\",\"\",\"◄\")","v":""},{"$nulls":11},{"$f":"IF(AK82=\"\",\"\",\"◄\")","v":""},{"$f":"IF(AK82=\"\",\"\",\"Φ63\")","v":""},{"$f":"IF(AK82=\"\",\"\",\"x\"&VLOOKUP(AK82,big_tabela,19,0))","v":""},{"$nulls":4},"",null,"",null,"",null,"",null,"",null,"",null,"",null,"1",null,"1"]
[{"$nulls":3},"1",null,"1",null,"1",null,"1",null,"",null,"",null,"",null,"",null,"",null,{"$f":"$X$83","v":""},{"$f":"$X$83","v":""},"",{"$f":"$X$83","v":""},{"$nulls":11},{"$f":"$AL$83","v":""},"","","","","",null,"",null,"",null,"",null,"",null,"",null,"",null,"",null,"1",null,"1"]
[{"$nulls":3},"1",null,"1",null,"1",null,"1",null,"",null,"",null,"",null,"",null,"",null,"",{"$nulls":4},{"$f":"IF(Y82=\"\",\"\",VLOOKUP(Y82,big_tabela,4,0))","v":""},null,{"$f":"IF(Y82=\"\",\"\",\"anemostat\")","v":""},{"$f":"IF(Y82=\"\",\"\",\"x\"&VLOOKUP(Y82,big_tabela,23,0))","v":""},null,null,{"$f":"IF(AK82=\"\",\"\",VLOOKUP(AK82,big_tabela,4,0))","v":""},null,{"$f":"IF(AK82=\"\",\"\",\"anemostat\")","v":""},{"$f":"IF(AK82=\"\",\"\",\"x\"&VLOOKUP(AK82,big_tabela,22,0))","v":""},{"$nulls":5},{"$f":"$AL$83","v":""},null,"",null,"",null,"",null,"",null,"",null,"",null,"",null,"1",null,"1"]
[{"$nulls":3},{"$f":"$X$20","v":"1"},null,"1",null,"1",null,"1",null,"",null,"",null,"",null,"",null,"",null,"",{"$nulls":19},{"$f":"$AL$83","v":""},null,"",null,{"$f":"$AL$69","v":""},null,"",null,"",null,"",null,"",null,"",null,"1",null,"1"]
[{"$nulls":4},{"$f":"Obliczenia!Y47","v":"12x63"},{"$nulls":37},{"$f":"Obliczenia!AA47","v":"12x63"}]
[{"$nulls":4},{"$f":"IF(E88<>\"\",IF(E90<>\"\",\"+\",\"\"),\"\")","v":""},{"$nulls":17},{"$f":"\"  \"&Obliczenia!U30&\"x rur DN63\"","v":"  8x rur DN63"},{"$nulls":15},{"$f":"Obliczenia!T30&\"x rur DN63\"","v":"9x rur DN63"},{"$nulls":3},{"$f":"IF(AQ88<>\"\",IF(AQ90<>\"\",\"+\",\"\"),\"\")","v":""}]
[{"$nulls":4},{"$f":"Obliczenia!Y48","v":""},{"$nulls":17},{"$f":"IF(Obliczenia!AB29=2,\"! Należy zastosować dwa rozdzielacze lub inną średnicę systemu\",\"\")","v":""},{"$nulls":11},{"$f":"IF(Obliczenia!Z29=2,\"! Należy zastosować dwa rozdzielacze lub inną średnicę systemu\",\"\")","v":""},{"$nulls":7},{"$f":"Obliczenia!AA48","v":""}]
[{"$nulls":15},{"$f":"$X$113","v":""},null,{"$f":"$X$106","v":""},null,{"$f":"$X$99","v":""},null,{"$f":"$X$92","v":""},null,null,{"$f":"IF(Obliczenia!E71=\"10\",\"\",Obliczenia!E71)","v":""},{"$nulls":11},{"$f":"IF(Obliczenia!E47=\"10\",\"\",Obliczenia!E47)","v":""},{"$nulls":4},{"$f":"$AL$92","v":""},null,{"$f":"$AL$99","v":""},null,{"$f":"$AL$106","v":""},null,{"$f":"$AL$113","v":""}]
[{"$nulls":15},"",null,"",null,"",null,"",null,{"$f":"IF(Y91<>\"\",\"1\",\"\")","v":""},null,null,{"$f":"IF(Y91=\"\",\"\",VLOOKUP(Y91,big_tabela,3,0))","v":""},null,{"$f":"IF(Y91=\"\",\"\",VLOOKUP(Y91,big_tabela,12,0))","v":""},"m3/h",null,null,{"$f":"IF(AK91=\"\",\"\",VLOOKUP(AK91,big_tabela,3,0))","v":""},null,{"$f":"IF(AK91=\"\",\"\",VLOOKUP(AK91,big_tabela,12,0))","v":""},"m3/h",null,{"$f":"IF(AK91<>\"\",\"1\",\"\")","v":""},{"$nulls":3},"",null,"",null,"",null,""]
[{"$nulls":15},"",null,"",null,"",null,"",{"$f":"IF(Y91=\"\",\"\",\"Φ63\")","v":""},{"$f":"IF(Y91=\"\",\"\",\"x\"&VLOOKUP(Y91,big_tabela,20,0))","v":""},{"$f":"IF(Y91=\"\",\"\",\"◄\")","v":""},{"$nulls":11},{"$f":"IF(AK91=\"\",\"\",\"◄\")","v":""},{"$f":"IF(AK91=\"\",\"\",\"Φ63\")","v":""},{"$f":"IF(AK91=\"\",\"\",\"x\"&VLOOKUP(AK91,big_tabela,19,0))","v":""},null,null,"",null,"",null,"",null,""]
[{"$nulls":15},"",null,"",null,"",null,"",{"$f":"$X$92","v":""},"",{"$f":"$X$92","v":""},{"$nulls":11},{"$f":"$AL$92","v":""},{"$f":"$AL$92","v":""},{"$f":"$AL$92","v":""},{"$f":"$AL$92","v":""},{"$f":"$AL$92","v":""},"",null,"",null,"",null,""]
[{"$nulls":15},"",null,"",null,"",{"$nulls":6},{"$f":"IF(Y91=\"\",\"\",VLOOKUP(Y91,big_tabela,4,0))","v":""},null,{"$f":"IF(Y91=\"\",\"\",\"anemostat\")","v":""},{"$f":"IF(Y91=\"\",\"\",\"x\"&VLOOKUP(Y91,big_tabela,23,0))","v":""},null,null,{"$f":"IF(AK91=\"\",\"\",VLOOKUP(AK91,big_tabela,4,0))","v":""},null,{"$f":"IF(AK91=\"\",\"\",\"anemostat\")","v":""},{"$f":"IF(AK91=\"\",\"\",\"x\"&VLOOKUP(AK91,big_tabela,22,0))","v":""},{"$nulls":7},"",null,"",null,""]
[{"$nulls":15},"",null,"",null,"",{"$nulls":23},"",null,"",null,""]
[{"$nulls":15},"",null,"",null,"",{"$nulls":23},"",null,"",null,""]
[{"$nulls":15},"",null,"",null,"",{"$nulls":4},{"$f":"IF(Obliczenia!E72=\"10\",\"\",Obliczenia!E72)","v":""},{"$nulls":11},{"$f":"IF(Obliczenia!E48=\"10\",\"\",Obliczenia!E48)","v":""},{"$nulls":6},"",null,"",null,""]
[{"$nulls":15},"",null,"",null,"",{"$nulls":3},{"$f":"IF(Y98<>\"\",\"1\",\"\")","v":""},null,null,{"$f":"IF(Y98=\"\",\"\",VLOOKUP(Y98,big_tabela,3,0))","v":""},null,{"$f":"IF(Y98=\"\",\"\",VLOOKUP(Y98,big_tabela,12,0))","v":""},"m3/h",null,null,{"$f":"IF(AK98=\"\",\"\",VLOOKUP(AK98,big_tabela,3,0))","v":""},null,{"$f":"IF(AK98=\"\",\"\",VLOOKUP(AK98,big_tabela,12,0))","v":""},"m3/h",null,{"$f":"IF(AK98<>\"\",\"1\",\"\")","v":""},{"$nulls":5},"",null,"",null,""]
[{"$nulls":15},"",null,"",null,"",null,null,{"$f":"IF(Y98=\"\",\"\",\"Φ63\")","v":""},{"$f":"IF(Y98=\"\",\"\",\"x\"&VLOOKUP(Y98,big_tabela,20,0))","v":""},{"$f":"IF(Y98=\"\",\"\",\"◄\")","v":""},{"$nulls":11},{"$f":"IF(AK98=\"\",\"\",\"◄\")","v":""},{"$f":"IF(AK98=\"\",\"\",\"Φ63\")","v":""},{"$f":"IF(AK98=\"\",\"\",\"x\"&VLOOKUP(AK98,big_tabela,19,0))","v":""},{"$nulls":4},"",null,"",null,""]
[{"$nulls":15},"",null,"",null,"",{"$f":"$X$99","v":""},"","","",{"$f":"$X$99","v":""},{"$nulls":11},{"$f":"$AL$99","v":""},"","","","","","","",null,"",null,""]
[{"$nulls":15},"",null,"",{"$nulls":8},{"$f":"IF(Y98=\"\",\"\",VLOOKUP(Y98,big_tabela,4,0))","v":""},null,{"$f":"IF(Y98=\"\",\"\",\"anemostat\")","v":""},{"$f":"IF(Y98=\"\",\"\",\"x\"&VLOOKUP(Y98,big_tabela,23,0))","v":""},null,null,{"$f":"IF(AK98=\"\",\"\",VLOOKUP(AK98,big_tabela,4,0))","v":""},null,{"$f":"IF(AK98=\"\",\"\",\"anemostat\")","v":""},{"$f":"IF(AK98=\"\",\"\",\"x\"&VLOOKUP(AK98,big_tabela,22,0))","v":""},{"$nulls":9},"",null,""]
[{"$nulls":15},"",null,"",{"$nulls":27},"",null,""]
[{"$nulls":15},"",null,"",{"$nulls":27},"",null,""]
[{"$nulls":15},"",null,"",{"$nulls":6},{"$f":"IF(Obliczenia!E73=\"10\",\"\",Obliczenia!E73)","v":""},{"$nulls":11},{"$f":"IF(Obliczenia!E49=\"10\",\"\",Obliczenia!E49)","v":""},{"$nulls":8},"",null,""]
[{"$nulls":15},"",null,"",{"$nulls":5},{"$f":"IF(Y105<>\"\",\"1\",\"\")","v":""},null,null,{"$f":"IF(Y105=\"\",\"\",VLOOKUP(Y105,big_tabela,3,0))","v":""},null,{"$f":"IF(Y105=\"\",\"\",VLOOKUP(Y105,big_tabela,12,0))","v":""},"m3/h",null,null,{"$f":"IF(AK105=\"\",\"\",VLOOKUP(AK105,big_tabela,3,0))","v":""},null,{"$f":"IF(AK105=\"\",\"\",VLOOKUP(AK105,big_tabela,12,0))","v":""},"m3/h",null,{"$f":"IF(AK105<>\"\",\"1\",\"\")","v":""},{"$nulls":7},"",null,""]
[{"$nulls":15},"",null,"",{"$nulls":4},{"$f":"IF(Y105=\"\",\"\",\"Φ63\")","v":""},{"$f":"IF(Y105=\"\",\"\",\"x\"&VLOOKUP(Y105,big_tabela,20,0))","v":""},{"$f":"IF(Y105=\"\",\"\",\"◄\")","v":""},{"$nulls":11},{"$f":"IF(AK105=\"\",\"\",\"◄\")","v":""},{"$f":"IF(AK105=\"\",\"\",\"Φ63\")","v":""},{"$f":"IF(AK105=\"\",\"\",\"x\"&VLOOKUP(AK105,big_tabela,19,0))","v":""},{"$nulls":6},"",null,""]
[{"$nulls":15},"",null,"",{"$f":"$X$106","v":""},"","","","","",{"$f":"$X$106","v":""},{"$nulls":11},{"$f":"$AL$106","v":""},"","","","","","","","","",null,""]
[{"$nulls":15},"",{"$nulls":10},{"$f":"IF(Y105=\"\",\"\",VLOOKUP(Y105,big_tabela,4,0))","v":""},null,{"$f":"IF(Y105=\"\",\"\",\"anemostat\")","v":""},{"$f":"IF(Y105=\"\",\"\",\"x\"&VLOOKUP(Y105,big_tabela,23,0))","v":""},null,null,{"$f":"IF(AK105=\"\",\"\",VLOOKUP(AK105,big_tabela,4,0))","v":""},null,{"$f":"IF(AK105=\"\",\"\",\"anemostat\")","v":""},{"$f":"IF(AK105=\"\",\"\",\"x\"&VLOOKUP(AK105,big_tabela,22,0))","v":""},{"$nulls":11},""]
[{"$nulls":15},"",{"$nulls":31},""]
[{"$nulls":15},"",{"$nulls":31},""]
[{"$nulls":15},"",{"$nulls":8},{"$f":"IF(Obliczenia!E74=\"10\",\"\",Obliczenia!E74)","v":""},{"$nulls":11},{"$f":"IF(Obliczenia!E50=\"10\",\"\",Obliczenia!E50)","v":""},{"$nulls":10},""]
[{"$nulls":15},"",{"$nulls":7},{"$f":"IF(Y112<>\"\",\"1\",\"\")","v":""},null,null,{"$f":"IF(Y112=\"\",\"\",VLOOKUP(Y112,big_tabela,3,0))","v":""},null,{"$f":"IF(Y112=\"\",\"\",VLOOKUP(Y112,big_tabela,12,0))","v":""},"m3/h",null,null,{"$f":"IF(AK112=\"\",\"\",VLOOKUP(AK112,big_tabela,3,0))","v":""},null,{"$f":"IF(AK112=\"\",\"\",VLOOKUP(AK112,big_tabela,12,0))","v":""},"m3/h",null,{"$f":"IF(AK112<>\"\",\"1\",\"\")","v":""},{"$nulls":9},""]
[{"$nulls":15},"",{"$nulls":6},{"$f":"IF(Y112=\"\",\"\",\"Φ63\")","v":""},{"$f":"IF(Y112=\"\",\"\",\"x\"&VLOOKUP(Y112,big_tabela,20,0))","v":""},{"$f":"IF(Y112=\"\",\"\",\"◄\")","v":""},{"$nulls":11},{"$f":"IF(AK112=\"\",\"\",\"◄\")","v":""},{"$f":"IF(AK112=\"\",\"\",\"Φ63\")","v":""},{"$f":"IF(AK112=\"\",\"\",\"x\"&VLOOKUP(AK112,big_tabela,19,0))","v":""},{"$nulls":8},""]
[{"$nulls":15},"",{"$f":"$X$113","v":""},"","","","","","","",{"$f":"$X$113","v":""},{"$nulls":11},{"$f":"$AL$113","v":""},"","","","","","","","","","",""]
[{"$nulls":26},{"$f":"IF(Y112=\"\",\"\",VLOOKUP(Y112,big_tabela,4,0))","v":""},null,{"$f":"IF(Y112=\"\",\"\",\"anemostat\")","v":""},{"$f":"IF(Y112=\"\",\"\",\"x\"&VLOOKUP(Y112,big_tabela,23,0))","v":""},null,null,{"$f":"IF(AK112=\"\",\"\",VLOOKUP(AK112,big_tabela,4,0))","v":""},null,{"$f":"IF(AK112=\"\",\"\",\"anemostat\")","v":""},{"$f":"IF(AK112=\"\",\"\",\"x\"&VLOOKUP(AK112,big_tabela,22,0))","v":""}]
[]
[]
[{"$nulls":28},{"$f":"X137","v":"Vitoair FS 300E MA 300m3/h"}]
[]
[]
[{"$nulls":23},{"$f":"\"Kanał zbiorczy 200/174, króciec przyłączeniowy Φ \"&Obliczenia!N59","v":"Kanał zbiorczy 200/174, króciec przyłączeniowy Φ 160"},{"$nulls":9},{"$f":"\"            Kanał zbiorczy 200/174, króciec przyłączeniowy Φ \"&Obliczenia!N59","v":"            Kanał zbiorczy 200/174, króciec przyłączeniowy Φ 160"}]
[]
[]
[{"$nulls":23},{"$f":"\"Kanał zbiorczy 200/174, króciec przyłączeniowy Φ \"&Obliczenia!N59","v":"Kanał zbiorczy 200/174, króciec przyłączeniowy Φ 160"},{"$nulls":9},{"$f":"\"            Kanał zbiorczy 200/174, króciec przyłączeniowy Φ \"&Obliczenia!N59","v":"            Kanał zbiorczy 200/174, króciec przyłączeniowy Φ 160"}]
[]
[]
[null,null,"Szacunkowy dobór centrali wentylacyjnej i systemu dystrybucji powietrza"]
[]
[]
[]
[]
[{"$nulls":22},"Centrala wentylacyjna"]
[]
[]
[]
[{"$nulls":10},{"$f":"Obliczenia!J83","v":""},{"$nulls":12},"Vitoair FS 300E MA 300m3/h",{"$nulls":4},{"$f":"\"R \"&AC138&\" %\"","v":"R 5 %"},{"$f":"VLOOKUP(X137,rozdzial,4,0)-VLOOKUP(X137,rozdzial,4,0)*(AC138/100)","v":{"v":11948.15,"d":"11,948.15 zł"}},null,null,"Sprawność temperaturowa ErP",{"$nulls":4},{"$f":"VLOOKUP($X$137,Obliczenia!J37:W45,8,0)","v":80},"[%]"]
[{"$nulls":23},{"$f":"IF(X137=\"Vitoair FS 300E MA 300m3/h\",\"Centrala wentylacji mechanicznej z odzyskiem ciepła i wilgoci\",\"Centrala wentylacji mechanicznej z odzyskiem ciepła\")","v":"Centrala wentylacji mechanicznej z odzyskiem ciepła i wilgoci"},{"$nulls":4},5,{"$nulls":3},"Stopień zmiany wilgotności",{"$nulls":4},{"$f":"VLOOKUP($X$137,Obliczenia!J37:W45,9,0)","v":74},"[%]"]
[{"$nulls":23},{"$f":"VLOOKUP(X137,rozdzial,3,0)","v":"Z023297"},{"$nulls":8},"Rodzaj wymiennika ciepła",{"$nulls":4},{"$f":"VLOOKUP($X$137,Obliczenia!J37:W45,11,0)","v":"Krzyżowy, entalpiczny"}]
[{"$nulls":32},"Klapa bypass",{"$nulls":4},{"$f":"VLOOKUP($X$137,Obliczenia!J37:W45,13,0)","v":"Tak"}]
[{"$nulls":23},{"$f":"\"    \"&VLOOKUP($X$137,Obliczenia!J37:W45,6,0)","v":"    39"},{"$f":"VLOOKUP($X$137,Obliczenia!J37:W45,4,0)&\" [m3/h]\"","v":"300 [m3/h]"},null,null,{"$f":"VLOOKUP($X$137,Obliczenia!J37:AA45,16,0)","v":"A"},{"$nulls":4},"Nagrzewnica powietrza zewnęrznego",{"$nulls":4},{"$f":"VLOOKUP($X$137,Obliczenia!J37:W45,14,0)","v":"Opcja 1,8kW"}]
[{"$nulls":27},{"$f":"VLOOKUP($X$137,Obliczenia!J37:AA45,17,0)","v":"A"},{"$nulls":4},"Odpływ kondensatu",{"$nulls":4},{"$f":"VLOOKUP($X$137,Obliczenia!J37:W45,12,0)","v":"Nie"}]
[{"$nulls":27},{"$f":"VLOOKUP($X$137,Obliczenia!J37:AA45,18,0)","v":"A"},{"$nulls":4},"Wymiary zewnętrzne D x W x S",{"$nulls":4},{"$f":"VLOOKUP($X$137,Obliczenia!J37:W45,10,0)","v":"1254 x 244 x 800"},"[mm]"]
[]
[{"$nulls":23},{"$f":"IF(X137=\"Vitoair FS 300E MA 300m3/h\",\"Nagrzewnica elektryczna powietrza 1,8kW\",\"\")","v":"Nagrzewnica elektryczna powietrza 1,8kW"},{"$nulls":5},{"$f":"IFERROR(VLOOKUP(X145,rozdzial,4,0)-VLOOKUP(X145,rozdzial,4,0)*(AC138/100),\"\")","v":{"v":1730.9,"d":"1,730.90 zł"}}]
[{"$nulls":23},{"$f":"IF(X137=\"Vitoair FS 300E MA 300m3/h\",\"Do ogrzewania wstępnego powietrza, montaż wewn. centrali\",\"\")","v":"Do ogrzewania wstępnego powietrza, montaż wewn. centrali"}]
[{"$nulls":23},{"$f":"IFERROR(VLOOKUP(X145,rozdzial,3,0),\"\")","v":7372079}]
[]
[{"$nulls":22},"Sterowanie"]
[]
[]
[]
[{"$nulls":32},"Vitotrol 300-E"]
[{"$nulls":10},{"$f":"Obliczenia!J82","v":""},{"$nulls":12},"Sterowanie przez aplikację ViCare",{"$nulls":5},{"$f":"IF(X154=\"Sterowanie przez aplikację ViCare\",\"0 zł\",VLOOKUP(X154,rozdzial,4,0)-VLOOKUP(X154,rozdzial,4,0)*(AC138/100))","v":"0 zł"},{"$nulls":4},"Radio"]
[{"$nulls":23},"do obsługi zdalnej centrali wentylacyjnej",{"$nulls":8},"Przełącznik\n4-pozycyjny",null,null,"Can-Bus"]
[{"$nulls":23},{"$f":"IF(X154=\"Sterowanie przez aplikację ViCare\",\"\",VLOOKUP(X154,rozdzial,3,0))","v":""},{"$nulls":10},"Can-Bus",{"$nulls":4},"ViCare"]
[{"$nulls":34},"Vitoair FS 300E MA",null,"opcja Vitocal x5x-A"]
[{"$nulls":23},"",{"$nulls":5},{"$f":"IFERROR(VLOOKUP(X158,rozdzial,4,0)-VLOOKUP(X158,rozdzial,4,0)*(AC138/100),\"\")","v":""},null,null,"Stand Alone",null,null,"  Z pompą ciepła Vitocal z WO1C"]
[{"$nulls":23},{"$f":"IF(X137=\"Vitoair FS 300E MA 300m3/h\",\"Opcja: do komunikacji z pompą ciepłą z regulatorem E3\",IF(X158=\"Przewód komunikacyjny Can-Bus 5m\",\"Uwaga! Nie ma zastosowanie w tym rozwiązaniu\",\"\"))","v":"Opcja: do komunikacji z pompą ciepłą z regulatorem E3"}]
[{"$nulls":23},{"$f":"IFERROR(VLOOKUP(X158,rozdzial,3,0),\"\")","v":""}]
[{"$nulls":32},"Moduł LB1",null,null,"Mod-Bus"]
[{"$nulls":22},"System dystrybucji  //  po stronie pomieszczeń",{"$nulls":16},"ViCare"]
[{"$nulls":34},"       Vitovent 300-W",null,"Vitotronic WO1C"]
[]
[]
[]
[{"$nulls":23},"Skrzynka do anemostatu",{"$nulls":4},{"$f":"Obliczenia!V30","v":8},{"$f":"VLOOKUP(X167,rozdzial,4,0)*AC167*(1-$AM$236/100)","v":{"v":2401.6,"d":"2,401.60 zł"}},{"$nulls":3},"Element usztywniający do skrzynki anemostatu",{"$nulls":3},{"$f":"AK169","v":8},{"$f":"VLOOKUP(AH167,rozdzial,4,0)*AL167*(1-$AM$236/100)","v":{"v":89.68,"d":"89.68 zł"}}]
[{"$nulls":23},"Skrzynka rozprężna do mocowania anemostatu",{"$nulls":9},"Poprawia osadzanie anemostatów w skrzynkach"]
[{"$nulls":23},{"$f":"VLOOKUP(X167,rozdzial,3,0)","v":7546057},{"$f":"VLOOKUP(X167,rozdzial,4,0)","v":{"v":316,"d":"316.00 zł"}},{"$nulls":8},{"$f":"VLOOKUP(AH167,rozdzial,3,0)","v":7634370},{"$f":"VLOOKUP(AH167,rozdzial,4,0)","v":{"v":11.8,"d":"11.80 zł"}},null,{"$f":"AC167","v":8}]
[]
[]
[{"$nulls":23},"Anemostat metalowy wywiewny",{"$nulls":4},{"$f":"Obliczenia!X30","v":4},{"$f":"VLOOKUP(X172,rozdzial,4,0)*AC172*(1-$AM$236/100)","v":{"v":189.61999999999998,"d":"189.62 zł"}},{"$nulls":3},"Anemostat metalowy nawiewny",{"$nulls":3},{"$f":"Obliczenia!W30","v":4},{"$f":"VLOOKUP(AH172,rozdzial,4,0)*AL172*(1-$AM$236/100)","v":{"v":231.79999999999998,"d":"231.80 zł"}}]
[{"$nulls":23},"Do wywiewania powietrza z pomieszczenia",{"$nulls":9},"Do nawiewania powietrza świeżego do pomieszczenia"]
[{"$nulls":23},{"$f":"VLOOKUP(X172,rozdzial,3,0)","v":7546060},{"$f":"VLOOKUP(X172,rozdzial,4,0)","v":{"v":49.9,"d":"49.90 zł"}},{"$nulls":8},{"$f":"VLOOKUP(AH172,rozdzial,3,0)","v":7546059},{"$f":"VLOOKUP(AH172,rozdzial,4,0)","v":{"v":61,"d":"61.00 zł"}}]
[]
[]
[{"$nulls":23},"Skrzynka rozdzielcza 18x63",{"$nulls":4},{"$f":"Obliczenia!Z34+Obliczenia!AB34","v":0},{"$f":"VLOOKUP(X177,rozdzial,4,0)*AC177*(1-$AM$236/100)","v":{"v":0,"d":"0.00 zł"}},{"$nulls":3},"Skrzynka rozdzielcza 12x63",{"$nulls":3},{"$f":"Obliczenia!Y33+Obliczenia!AA33","v":2},{"$f":"VLOOKUP(AH177,rozdzial,4,0)*AL177*(1-$AM$236/100)","v":{"v":1903.8,"d":"1,903.80 zł"}}]
[{"$nulls":23},"Rozdzielacz powietrza podwójny",{"$nulls":9},"Pozdzielacz powietrza pojedynczy"]
[{"$nulls":23},{"$f":"VLOOKUP(X177,rozdzial,3,0)","v":7546061},{"$f":"VLOOKUP(X177,rozdzial,4,0)","v":{"v":1172,"d":"1,172.00 zł"}},{"$nulls":8},{"$f":"VLOOKUP(AH177,rozdzial,3,0)","v":7546062},{"$f":"VLOOKUP(AH177,rozdzial,4,0)","v":{"v":1002,"d":"1,002.00 zł"}}]
[]
[]
[{"$nulls":23},"Elastyczny kanał okrągły DN63",{"$nulls":4},6,{"$f":"VLOOKUP(X182,rozdzial,4,0)*AC182*(1-$AM$236/100)","v":{"v":3015.2999999999997,"d":"3,015.30 zł"}}]
[{"$nulls":23},"1 rolka = 50 m długości"]
[{"$nulls":23},{"$f":"VLOOKUP(X182,rozdzial,3,0)","v":7732939},{"$f":"VLOOKUP(X182,rozdzial,4,0)","v":{"v":529,"d":"529.00 zł"}},null,null,{"$f":"ROUNDUP(AC167*20/50,0)","v":4}]
[]
[]
[{"$nulls":22},"System dystrybucji  //  po stronie zewnętrznej"]
[]
[]
[]
[{"$nulls":23},"Kanał izolowany 200/174",{"$nulls":4},{"$f":"AB193","v":4},{"$f":"VLOOKUP(X191,rozdzial,4,0)*AC191*(1-$AM$236/100)","v":{"v":1504.8,"d":"1,504.80 zł"}},{"$nulls":3},"Kolano izolowane z mufą 90 stopni",{"$nulls":3},4,{"$f":"VLOOKUP(AH191,rozdzial,4,0)*AL191*(1-$AM$236/100)","v":{"v":680.1999999999999,"d":"680.20 zł"}}]
[{"$nulls":23},"1 sztuka = 2 m długości, przepływ maksymalny 400 m3/h",{"$nulls":9},"Do zmiany kierunku kanałów izolowanych 200/174"]
[{"$nulls":23},{"$f":"VLOOKUP(X191,rozdzial,3,0)","v":7546070},{"$f":"VLOOKUP(X191,rozdzial,4,0)","v":{"v":396,"d":"396.00 zł"}},null,null,{"$f":"ROUNDUP(Obliczenia!V30*20/50,0)","v":4},{"$nulls":5},{"$f":"VLOOKUP(AH191,rozdzial,3,0)","v":7546071},{"$f":"VLOOKUP(AH191,rozdzial,4,0)","v":{"v":179,"d":"179.00 zł"}},null,4]
[]
[]
[{"$nulls":23},"Czerpnia/wyrzutnia ścienna z rurą",{"$nulls":4},2,{"$f":"VLOOKUP(X196,rozdzial,4,0)*AC196*(1-$AM$236/100)","v":{"v":568.1,"d":"568.10 zł"}},{"$nulls":3},{"$f":"IF(Obliczenia!N57=\"Vitovent 300-W 325m3/h lewa\",\"Mufa/redukcja 200/150\",IF(Obliczenia!N57=\"Vitovent 300-W 325m3/h prawa\",\"Mufa/redukcja 200/150\",IF(Obliczenia!N57=\"Vitovent 300-W 400m3/h lewa\",\"Mufa/redukcja 200/180\",IF(Obliczenia!N57=\"Vitovent 300-W 400m3/h prawa\",\"Mufa/redukcja 200/180\",IF(Obliczenia!N57=\"Vitovent 300-W 225m3/h lewa\",\"Mufa/redukcja 200/125\",IF(Obliczenia!N57=\"Vitovent 300-W 225m3/h prawa\",\"Mufa/redukcja 200/125\",\"Mufa/redukcja 200/150\"))))))","v":"Mufa/redukcja 200/150"},{"$nulls":3},4,{"$f":"VLOOKUP(AH196,rozdzial,4,0)*AL196*(1-$AM$236/100)","v":{"v":288.8,"d":"288.80 zł"}}]
[{"$nulls":23},"Do bezpośredniego podłączenia kanału izolowanego 200/174",{"$nulls":9},"Do przyłączenia kanału 200/174 do króćców centrali"]
[{"$nulls":23},{"$f":"VLOOKUP(X196,rozdzial,3,0)","v":7663729},{"$f":"VLOOKUP(X196,rozdzial,4,0)","v":{"v":299,"d":"299.00 zł"}},{"$nulls":8},{"$f":"VLOOKUP(AH196,rozdzial,3,0)","v":7546075},{"$f":"VLOOKUP(AH196,rozdzial,4,0)","v":{"v":76,"d":"76.00 zł"}}]
{"$rows_empty":7}
[{"$nulls":22},"Elementy uzupełniające"]
[]
[]
[]
[{"$nulls":23},"Nóż do kanałów DN63",{"$nulls":4},0,{"$f":"VLOOKUP(X210,rozdzial,4,0)*AC210*(1-$AM$236/100)","v":{"v":0,"d":"0.00 zł"}},{"$nulls":3},"Łącznik kanałów DN63",{"$nulls":3},4,{"$f":"VLOOKUP(AH210,rozdzial,4,0)*AL210*(1-$AM$236/100)","v":{"v":148.96,"d":"148.96 zł"}}]
[{"$nulls":23},"Do szybkiego i precyzyjnego obcinania rur",{"$nulls":9},"Do szczelnego łączenia kanałów elastycznych DN63"]
[{"$nulls":23},{"$f":"VLOOKUP(X210,rozdzial,3,0)","v":7546068},{"$f":"VLOOKUP(X210,rozdzial,4,0)","v":{"v":296,"d":"296.00 zł"}},{"$nulls":8},{"$f":"VLOOKUP(AH210,rozdzial,3,0)","v":7546067},{"$f":"VLOOKUP(AH210,rozdzial,4,0)","v":{"v":39.2,"d":"39.20 zł"}}]
[]
[]
[{"$nulls":23},"Kolano izolowane z mufą 45 stopni",{"$nulls":4},0,{"$f":"VLOOKUP(X215,rozdzial,4,0)*AC215*(1-$AM$236/100)","v":{"v":0,"d":"0.00 zł"}},{"$nulls":3},"Trójnik izolowany 200/174 bez mufy",{"$nulls":3},{"$f":"AL217","v":0},{"$f":"VLOOKUP(AH215,rozdzial,4,0)*AL215*(1-$AM$236/100)","v":{"v":0,"d":"0.00 zł"}}]
[{"$nulls":23},"Do zmiany kierunku kanałów izolowanych 200/174",{"$nulls":9},"Do rozdzielenia kanału izolowanego 200/174"]
[{"$nulls":23},{"$f":"VLOOKUP(X215,rozdzial,3,0)","v":7546072},{"$f":"VLOOKUP(X215,rozdzial,4,0)","v":{"v":131,"d":"131.00 zł"}},{"$nulls":8},{"$f":"VLOOKUP(AH215,rozdzial,3,0)","v":7775845},{"$f":"VLOOKUP(AH215,rozdzial,4,0)","v":{"v":800,"d":"800.00 zł"}},null,null,{"$f":"INT(AC177/2)","v":0}]
[]
[]
[{"$nulls":23},"Mufa łącząca 200/200",{"$nulls":4},0,{"$f":"VLOOKUP(X220,rozdzial,4,0)*AC220*(1-$AM$236/100)","v":{"v":0,"d":"0.00 zł"}},{"$nulls":3},"Króciec przyłączeniowy do przedłużania DN125",{"$nulls":3},0,{"$f":"VLOOKUP(AH220,rozdzial,4,0)*AL220*(1-$AM$236/100)","v":{"v":0,"d":"0.00 zł"}}]
[{"$nulls":23},"do sterowania i diagnostyki centrali Vitovent",{"$nulls":9},"Do przedłużenia króćca przyłączeniowego skrzynki rozpr."]
[{"$nulls":23},{"$f":"VLOOKUP(X220,rozdzial,3,0)","v":7546073},{"$f":"VLOOKUP(X220,rozdzial,4,0)","v":{"v":61,"d":"61.00 zł"}},{"$nulls":8},{"$f":"VLOOKUP(AH220,rozdzial,3,0)","v":7546058},{"$f":"VLOOKUP(AH220,rozdzial,4,0)","v":{"v":34,"d":"34.00 zł"}}]
[]
[]
[{"$nulls":23},"Uchwyt mocujący do kanałów DN63",{"$nulls":4},0,{"$f":"VLOOKUP(X225,rozdzial,4,0)*AC225*(1-$AM$236/100)","v":{"v":0,"d":"0.00 zł"}},{"$nulls":3},"Tłumik dźwięku, giętki; 1,1m; DN180; 50mm",{"$nulls":3},0,{"$f":"VLOOKUP(AH225,rozdzial,4,0)*AL225*(1-$AM$236/100)","v":{"v":0,"d":"0.00 zł"}}]
[{"$nulls":23},"do sterowania i diagnostyki centrali Vitovent",{"$nulls":9},"do sterowania i diagnostyki centrali Vitovent"]
[{"$nulls":23},{"$f":"VLOOKUP(X225,rozdzial,3,0)","v":7546069},{"$f":"VLOOKUP(X225,rozdzial,4,0)","v":{"v":8,"d":"8.00 zł"}},{"$nulls":8},{"$f":"VLOOKUP(AH225,rozdzial,3,0)","v":"ZK03037"},{"$f":"VLOOKUP(AH225,rozdzial,4,0)","v":{"v":651,"d":"651.00 zł"}}]
{"$rows_empty":7}
[null,null,{"$f":"Dane!S241","v":"Autor:"},{"$nulls":4},{"$f":"Dane!T241","v":"PanD, 2023"},{"$nulls":27},"Cena:",{"$f":"AD137+IFERROR(VLOOKUP(X145,rozdzial,4,0),0)+AD154+IFERROR(VLOOKUP(X158,rozdzial,4,0),0)+AD167+AM167+AM172+AD172+AD177+AM177+AD182+AD191+AD196+AM191+AM196+AD210+AM210+AD215+AM215+AM220+AD220+AD225+AM225","v":{"v":24792.809999999994,"d":"24,792.81 zł"}},null,{"$f":"\"R \"&AM236&\" %\"","v":"R 5 %"}]
[{"$nulls":38},5]
[]
[{"$nulls":40},{"$f":"IF(Obliczenia!AP10<>0,Obliczenia!AP10,\"\")","v":""}]
[]
[{"$nulls":40},{"$f":"IF(Obliczenia!AP11<>0,Obliczenia!AP11,\"\")","v":3}]
[]
[{"$nulls":40},{"$f":"IF(Obliczenia!AP12<>0,Obliczenia!AP12,\"\")","v":4}]
[]
[{"$nulls":40},{"$f":"IF(Obliczenia!AP13<>0,Obliczenia!AP13,\"\")","v":""}]
[]
[]
[]
[]
[]
[]
[{"$nulls":40},{"$f":"IF(Obliczenia!AP14<>0,Obliczenia!AP14,\"\")","v":""}]
[{"$nulls":40},{"$f":"IF(Obliczenia!AP15<>0,Obliczenia!AP15,\"\")","v":""}]
[{"$nulls":40},{"$f":"IF(Obliczenia!AP16<>0,Obliczenia!AP16,\"\")","v":""}]
[{"$nulls":40},{"$f":"IF(Obliczenia!AP17<>0,Obliczenia!AP17,\"\")","v":""}]
[{"$nulls":40},{"$f":"IF(Obliczenia!AP18<>0,Obliczenia!AP18,\"\")","v":""}]

{"sheet":"System DN75","index":2,"n_rows":255,"n_cols":60,"rows_kept":255,"merged":[[0,37,0,38],[2,35,3,35],[2,36,3,37],[2,38,3,46],[7,2,8,35],[10,2,11,28],[16,25,16,29],[16,31,16,35],[18,24,19,24],[18,36,19,36],[19,26,20,27],[19,28,20,28],[19,29,20,29],[19,32,20,33],[19,34,20,34],[19,35,20,35],[25,24,26,24],[25,36,26,36],[26,26,27,27],[26,28,27,28],[26,29,27,29],[26,32,27,33],[26,34,27,34],[26,35,27,35],[32,24,33,24],[32,36,33,36],[33,26,34,27],[33,28,34,28],[33,29,34,29],[33,32,34,33],[33,34,34,34],[33,35,34,35],[39,24,40,24],[39,36,40,36],[40,26,41,27],[40,28,41,28],[40,29,41,29],[40,32,41,33],[40,34,41,34],[40,35,41,35],[46,24,47,24],[46,36,47,36],[47,26,48,27],[47,28,48,28],[47,29,48,29],[47,32,48,33],[47,34,48,34],[47,35,48,35],[53,24,54,24],[53,36,54,36],[54,26,55,27],[54,28,55,28],[54,29,55,29],[54,32,55,33],[54,34,55,34],[54,35,55,35],[60,24,61,24],[60,36,61,36],[61,26,62,27],[61,28,62,28],[61,29,62,29],[61,32,62,33],[61,34,62,34],[61,35,62,35],[67,24,68,24],[67,36,68,36],[68,26,69,27],[68,28,69,28],[68,29,69,29],[68,32,69,33],[68,34,69,34],[68,35,69,35],[74,24,75,24],[74,36,75,36],[75,26,76,27],[75,28,76,28],[75,29,76,29],[75,32,76,33],[75,34,76,34],[75,35,76,35],[81,24,82,24],[81,36,82,36],[82,26,83,27],[82,28,83,28],[82,29,83,29],[82,32,83,33],[82,34,83,34],[82,35,83,35],[87,4,87,20],[87,42,87,58],[88,4,88,20],[88,38,88,40],[88,42,88,58],[89,4,89,20],[89,34,89,40],[89,42,89,58],[90,24,91,24],[90,36,91,36],[91,26,92,27],[91,28,92,28],[91,29,92,29],[91,32,92,33],[91,34,92,34],[91,35,92,35],[97,24,98,24],[97,36,98,36],[98,26,99,27],[98,28,99,28],[98,29,99,29],[98,32,99,33],[98,34,99,34],[98,35,99,35],[104,24,105,24],[104,36,105,36],[105,26,106,27],[105,28,106,28],[105,29,106,29],[105,32,106,33],[105,34,106,34],[105,35,106,35],[111,24,112,24],[111,36,112,36],[112,26,113,27],[112,28,113,28],[112,29,113,29],[112,32,113,33],[112,34,113,34],[112,35,113,35],[118,28,118,33],[127,2,128,39],[132,22,133,25],[136,10,138,22],[136,23,136,27],[136,29,136,30],[144,23,144,27],[144,29,144,30],[148,22,149,27],[153,10,158,22],[153,23,153,27],[153,29,153,30],[154,32,155,32],[154,35,154,36],[156,34,156,35],[157,23,157,27],[157,29,157,30],[160,35,160,36],[161,22,163,27],[162,36,162,37],[166,28,167,28],[166,29,166,30],[166,37,167,37],[166,38,166,39],[167,33,168,36],[171,28,172,28],[171,29,171,30],[171,37,172,37],[171,38,171,39],[176,28,177,28],[176,29,176,30],[176,32,179,32],[176,37,177,37],[176,38,176,39],[177,23,178,27],[177,33,178,36],[181,28,182,28],[181,29,181,30],[181,32,184,32],[181,37,182,37],[181,38,181,39],[182,23,183,27],[182,33,183,36],[186,28,187,28],[186,29,186,30],[186,32,189,32],[186,37,187,37],[186,38,186,39],[187,23,188,27],[187,33,188,36],[191,28,192,28],[191,29,191,30],[191,32,194,32],[191,37,192,37],[191,38,191,39],[192,23,193,27],[192,33,193,36],[196,22,197,27],[200,28,201,28],[200,29,200,30],[200,37,201,37],[200,38,200,39],[205,28,206,28],[205,29,205,30],[205,37,206,37],[205,38,205,39],[210,28,211,28],[210,29,210,30],[215,22,216,26],[219,28,220,28],[219,29,219,30],[219,37,220,37],[219,38,219,39],[224,2,224,5],[224,28,225,28],[224,29,224,30],[224,37,225,37],[224,38,224,39],[225,33,226,36],[229,28,230,28],[229,29,229,30],[229,37,230,37],[229,38,229,39],[234,36,234,37]]}
[{"$nulls":29},"R system",{"$f":"AM236/100","v":{"v":0.05,"d":"5%"}},null,"R centrala",{"$f":"AC138/100","v":{"v":0.05,"d":"5%"}},null,null,"Suma",{"$f":"AK235","v":{"v":27591.149999999994,"d":"27,591.15 zł"}}]
[]
[{"$nulls":35},"Data:   ",{"$f":"TODAY()","v":"2023-10-25"},null,{"$f":"Dane!S3","v":"wersja 23/10/2023"}]
[]
[]
[]
[]
[null,null,"System dystrybucji powietrza  |  okrągły Φ75"]
[]
[]
[null,null,"Uproszczony schemat instalacji"]
[]
[]
[]
[]
[]
[{"$nulls":25},"Powietrze wywiewane",{"$nulls":5},"Powietrze nawiewane"]
[]
[{"$nulls":24},{"$f":"IF(Obliczenia!E61=\"10\",\"\",Obliczenia!E61)","v":"0.1"},{"$nulls":11},{"$f":"IF(Obliczenia!E37=\"10\",\"\",Obliczenia!E37)","v":"0.5"}]
[{"$nulls":23},{"$f":"IF(Y19<>\"\",\"1\",\"\")","v":"1"},null,null,{"$f":"IF(Y19=\"\",\"\",VLOOKUP(Y19,big_tabela,3,0))","v":"Wiatrołap"},null,{"$f":"IF(Y19=\"\",\"\",VLOOKUP(Y19,big_tabela,12,0))","v":25},"m3/h",null,null,{"$f":"IF(AK19=\"\",\"\",VLOOKUP(AK19,big_tabela,3,0))","v":"Salon"},null,{"$f":"IF(AK19=\"\",\"\",VLOOKUP(AK19,big_tabela,12,0))","v":120},"m3/h",null,{"$f":"IF(AK19<>\"\",\"1\",\"\")","v":"1"}]
[{"$nulls":22},{"$f":"IF(Y19=\"\",\"\",\"Φ75\")","v":"Φ75"},{"$f":"IF(Y19=\"\",\"\",\"x\"&VLOOKUP(Y19,big_tabela,42,0))","v":"x1"},{"$f":"IF(Y19=\"\",\"\",\"◄\")","v":"◄"},{"$nulls":11},{"$f":"IF(AK19=\"\",\"\",\"◄\")","v":"◄"},{"$f":"IF(AK19=\"\",\"\",\"Φ75\")","v":"Φ75"},{"$f":"IF(AK19=\"\",\"\",\"x\"&VLOOKUP(AK19,big_tabela,41,0))","v":"x4"}]
[{"$nulls":3},{"$f":"$X$20","v":"1"},{"$f":"$X$20","v":"1"},{"$f":"$X$20","v":"1"},"1","1","1","1","1","1","1","1","1","1","1","1","1","1","1","1","1","1","1",{"$nulls":11},{"$f":"$AL$20","v":"1"},{"$f":"$AL$20","v":"1"},"1","1","1","1","1","1","1","1","1","1","1","1","1","1","1","1","1","1","1","1","1","1"]
[{"$nulls":3},{"$f":"$X$20","v":"1"},{"$nulls":22},{"$f":"IF(Y19=\"\",\"\",VLOOKUP(Y19,big_tabela,4,0))","v":"0.1 Wiatrołap"},null,{"$f":"IF(Y19=\"\",\"\",\"anemostat\")","v":"anemostat"},{"$f":"IF(Y19=\"\",\"\",\"x\"&VLOOKUP(Y19,big_tabela,45,0))","v":"x1"},null,null,{"$f":"IF(AK19=\"\",\"\",VLOOKUP(AK19,big_tabela,4,0))","v":"0.6 Salon"},null,{"$f":"IF(AK19=\"\",\"\",\"anemostat\")","v":"anemostat"},{"$f":"IF(AK19=\"\",\"\",\"x\"&VLOOKUP(AK19,big_tabela,44,0))","v":"x2"},{"$nulls":23},"1"]
[{"$nulls":3},"1",{"$nulls":55},"1"]
[{"$nulls":3},"1",{"$nulls":55},"1"]
[{"$nulls":3},"1",{"$nulls":20},{"$f":"IF(Obliczenia!E62=\"10\",\"\",Obliczenia!E62)","v":"0.6"},{"$nulls":11},{"$f":"IF(Obliczenia!E38=\"10\",\"\",Obliczenia!E38)","v":"0.4"},{"$nulls":22},"1"]
[{"$nulls":3},"1",{"$nulls":19},{"$f":"IF(Y26<>\"\",\"1\",\"\")","v":"1"},null,null,{"$f":"IF(Y26=\"\",\"\",VLOOKUP(Y26,big_tabela,3,0))","v":"Spiżarnia"},null,{"$f":"IF(Y26=\"\",\"\",VLOOKUP(Y26,big_tabela,12,0))","v":25},"m3/h",null,null,{"$f":"IF(AK26=\"\",\"\",VLOOKUP(AK26,big_tabela,3,0))","v":"Jadalnia - nawiew"},null,{"$f":"IF(AK26=\"\",\"\",VLOOKUP(AK26,big_tabela,12,0))","v":80},"m3/h",null,{"$f":"IF(AK26<>\"\",\"1\",\"\")","v":"1"},{"$nulls":21},"1"]
[{"$nulls":3},"1",{"$nulls":18},{"$f":"IF(Y26=\"\",\"\",\"Φ75\")","v":"Φ75"},{"$f":"IF(Y26=\"\",\"\",\"x\"&VLOOKUP(Y26,big_tabela,42,0))","v":"x1"},{"$f":"IF(Y26=\"\",\"\",\"◄\")","v":"◄"},{"$nulls":11},{"$f":"IF(AK26=\"\",\"\",\"◄\")","v":"◄"},{"$f":"IF(AK26=\"\",\"\",\"Φ75\")","v":"Φ75"},{"$f":"IF(AK26=\"\",\"\",\"x\"&VLOOKUP(AK26,big_tabela,41,0))","v":"x3"},{"$nulls":20},"1"]
[{"$nulls":3},"1",null,{"$f":"$X$27","v":"1"},"1","1","1","1","1","1","1","1","1","1","1","1","1","1","1","1","1","1",{"$f":"$X$27","v":"1"},{"$nulls":11},{"$f":"$AL$27","v":"1"},{"$f":"$AL$27","v":"1"},"1","1","1","1","1","1","1","1","1","1","1","1","1","1","1","1","1","1","1","1",null,"1"]
[{"$nulls":3},"1",null,"1",{"$nulls":20},{"$f":"IF(Y26=\"\",\"\",VLOOKUP(Y26,big_tabela,4,0))","v":"04.a Spiżarnia"},null,{"$f":"IF(Y26=\"\",\"\",\"anemostat\")","v":"anemostat"},{"$f":"IF(Y26=\"\",\"\",\"x\"&VLOOKUP(Y26,big_tabela,45,0))","v":"x1"},null,null,{"$f":"IF(AK26=\"\",\"\",VLOOKUP(AK26,big_tabela,4,0))","v":"0.5 Jadalnia"},null,{"$f":"IF(AK26=\"\",\"\",\"anemostat\")","v":"anemostat"},{"$f":"IF(AK26=\"\",\"\",\"x\"&VLOOKUP(AK26,big_tabela,44,0))","v":"x2"},{"$nulls":21},"1",null,"1"]
[{"$nulls":3},"1",null,"1",{"$nulls":51},"1",null,"1"]
[{"$nulls":3},"1",null,"1",{"$nulls":51},"1",null,"1"]
[{"$nulls":3},"1",null,"1",{"$nulls":18},{"$f":"IF(Obliczenia!E63=\"10\",\"\",Obliczenia!E63)","v":"0.2"},{"$nulls":11},{"$f":"IF(Obliczenia!E39=\"10\",\"\",Obliczenia!E39)","v":""},{"$nulls":20},"1",null,"1"]
[{"$nulls":3},"1",null,"1",1,{"$nulls":16},{"$f":"IF(Y33<>\"\",\"1\",\"\")","v":"1"},null,null,{"$f":"IF(Y33=\"\",\"\",VLOOKUP(Y33,big_tabela,3,0))","v":"Łazienka"},null,{"$f":"IF(Y33=\"\",\"\",VLOOKUP(Y33,big_tabela,12,0))","v":75},"m3/h",null,null,{"$f":"IF(AK33=\"\",\"\",VLOOKUP(AK33,big_tabela,3,0))","v":""},null,{"$f":"IF(AK33=\"\",\"\",VLOOKUP(AK33,big_tabela,12,0))","v":""},"m3/h",null,{"$f":"IF(AK33<>\"\",\"1\",\"\")","v":""},{"$nulls":19},"1",null,"1"]
[{"$nulls":3},"1",null,"1",{"$nulls":16},{"$f":"IF(Y33=\"\",\"\",\"Φ75\")","v":"Φ75"},{"$f":"IF(Y33=\"\",\"\",\"x\"&VLOOKUP(Y33,big_tabela,42,0))","v":"x3"},{"$f":"IF(Y33=\"\",\"\",\"◄\")","v":"◄"},{"$nulls":11},{"$f":"IF(AK33=\"\",\"\",\"◄\")","v":""},{"$f":"IF(AK33=\"\",\"\",\"Φ75\")","v":""},{"$f":"IF(AK33=\"\",\"\",\"x\"&VLOOKUP(AK33,big_tabela,41,0))","v":""},{"$nulls":18},"1",null,"1"]
[{"$nulls":3},"1",null,"1",null,{"$f":"$X$34","v":"1"},"1","1","1","1","1","1","1","1","1","1","1","1","1","1","1",{"$f":"$X$34","v":"1"},{"$f":"$X$34","v":"1"},{"$nulls":11},{"$f":"$AL$34","v":""},{"$f":"$AL$34","v":""},"","","","","","","","","","","","","","","","","","",null,"1",null,"1"]
[{"$nulls":3},"1",null,"1",null,"1",{"$nulls":18},{"$f":"IF(Y33=\"\",\"\",VLOOKUP(Y33,big_tabela,4,0))","v":"03. Łazienka"},null,{"$f":"IF(Y33=\"\",\"\",\"anemostat\")","v":"anemostat"},{"$f":"IF(Y33=\"\",\"\",\"x\"&VLOOKUP(Y33,big_tabela,45,0))","v":"x2"},null,null,{"$f":"IF(AK33=\"\",\"\",VLOOKUP(AK33,big_tabela,4,0))","v":""},null,{"$f":"IF(AK33=\"\",\"\",\"anemostat\")","v":""},{"$f":"IF(AK33=\"\",\"\",\"x\"&VLOOKUP(AK33,big_tabela,44,0))","v":""},{"$nulls":19},"",null,"1",null,"1"]
[{"$nulls":3},"1",null,"1",null,"1",{"$nulls":47},"",null,"1",null,{"$f":"$AL$20","v":"1"}]
[{"$nulls":3},"1",null,"1",null,"1",{"$nulls":47},"",null,"1",null,"1"]
[{"$nulls":3},"1",null,"1",null,"1",{"$nulls":16},{"$f":"IF(Obliczenia!E64=\"10\",\"\",Obliczenia!E64)","v":"0.3"},{"$nulls":11},{"$f":"IF(Obliczenia!E40=\"10\",\"\",Obliczenia!E40)","v":""},{"$nulls":18},"",null,"1",null,"1"]
[{"$nulls":3},"1",null,"1",null,"1",{"$nulls":15},{"$f":"IF(Y40<>\"\",\"1\",\"\")","v":"1"},null,null,{"$f":"IF(Y40=\"\",\"\",VLOOKUP(Y40,big_tabela,3,0))","v":"Kuchnia otwarta z kuchenką elektryczną"},null,{"$f":"IF(Y40=\"\",\"\",VLOOKUP(Y40,big_tabela,12,0))","v":75},"m3/h",null,null,{"$f":"IF(AK40=\"\",\"\",VLOOKUP(AK40,big_tabela,3,0))","v":""},null,{"$f":"IF(AK40=\"\",\"\",VLOOKUP(AK40,big_tabela,12,0))","v":""},"m3/h",null,{"$f":"IF(AK40<>\"\",\"1\",\"\")","v":""},{"$nulls":17},"",null,"1",null,"1"]
[{"$nulls":3},"1",null,"1",null,"1",{"$nulls":14},{"$f":"IF(Y40=\"\",\"\",\"Φ75\")","v":"Φ75"},{"$f":"IF(Y40=\"\",\"\",\"x\"&VLOOKUP(Y40,big_tabela,42,0))","v":"x3"},{"$f":"IF(Y40=\"\",\"\",\"◄\")","v":"◄"},{"$nulls":11},{"$f":"IF(AK40=\"\",\"\",\"◄\")","v":""},{"$f":"IF(AK40=\"\",\"\",\"Φ75\")","v":""},{"$f":"IF(AK40=\"\",\"\",\"x\"&VLOOKUP(AK40,big_tabela,41,0))","v":""},{"$nulls":16},"",null,"1",null,"1"]
[{"$nulls":3},"1",null,"1",null,"1",null,{"$f":"$X$41","v":"1"},"1","1","1","1","1","1","1","1","1","1","1","1","1","1",{"$f":"$X$41","v":"1"},{"$nulls":11},{"$f":"$AL$41","v":""},{"$f":"$AL$41","v":""},"","","","","","","","","","","","","","","","",null,"",null,"1",null,"1"]
[{"$nulls":3},"1",null,"1",null,"1",null,"1",{"$nulls":16},{"$f":"IF(Y40=\"\",\"\",VLOOKUP(Y40,big_tabela,4,0))","v":"04. Kuchnia"},null,{"$f":"IF(Y40=\"\",\"\",\"anemostat\")","v":"anemostat"},{"$f":"IF(Y40=\"\",\"\",\"x\"&VLOOKUP(Y40,big_tabela,45,0))","v":"x2"},null,null,{"$f":"IF(AK40=\"\",\"\",VLOOKUP(AK40,big_tabela,4,0))","v":""},null,{"$f":"IF(AK40=\"\",\"\",\"anemostat\")","v":""},{"$f":"IF(AK40=\"\",\"\",\"x\"&VLOOKUP(AK40,big_tabela,44,0))","v":""},{"$nulls":17},"",null,"",null,"1",null,"1"]
[{"$nulls":3},"1",null,{"$f":"$X$27","v":"1"},null,"1",null,"1",{"$nulls":43},"",null,"",null,{"$f":"$AL$27","v":"1"},null,"1"]
[{"$nulls":3},"1",null,"1",null,"1",null,"1",{"$nulls":43},"",null,"",null,"1",null,"1"]
[{"$nulls":3},"1",null,"1",null,"1",null,"1",{"$nulls":14},{"$f":"IF(Obliczenia!E65=\"10\",\"\",Obliczenia!E65)","v":""},{"$nulls":11},{"$f":"IF(Obliczenia!E41=\"10\",\"\",Obliczenia!E41)","v":""},{"$nulls":16},"",null,"",null,"1",null,"1"]
[{"$nulls":3},"1",null,"1",null,"1",null,"1",{"$nulls":13},{"$f":"IF(Y47<>\"\",\"1\",\"\")","v":""},null,null,{"$f":"IF(Y47=\"\",\"\",VLOOKUP(Y47,big_tabela,3,0))","v":""},null,{"$f":"IF(Y47=\"\",\"\",VLOOKUP(Y47,big_tabela,12,0))","v":""},"m3/h",null,null,{"$f":"IF(AK47=\"\",\"\",VLOOKUP(AK47,big_tabela,3,0))","v":""},null,{"$f":"IF(AK47=\"\",\"\",VLOOKUP(AK47,big_tabela,12,0))","v":""},"m3/h",null,{"$f":"IF(AK47<>\"\",\"1\",\"\")","v":""},{"$nulls":15},"",null,"",null,"1",null,"1"]
[{"$nulls":3},"1",null,"1",null,"1",null,"1",{"$nulls":12},{"$f":"IF(Y47=\"\",\"\",\"Φ75\")","v":""},{"$f":"IF(Y47=\"\",\"\",\"x\"&VLOOKUP(Y47,big_tabela,42,0))","v":""},{"$f":"IF(Y47=\"\",\"\",\"◄\")","v":""},{"$nulls":11},{"$f":"IF(AK47=\"\",\"\",\"◄\")","v":""},{"$f":"IF(AK47=\"\",\"\",\"Φ75\")","v":""},{"$f":"IF(AK47=\"\",\"\",\"x\"&VLOOKUP(AK47,big_tabela,41,0))","v":""},{"$nulls":14},"",null,"",null,"1",null,"1"]
[{"$nulls":3},"1",null,"1",null,"1",null,"1",null,{"$f":"$X$48","v":""},"","","","","","","","","","","","",{"$f":"$X$48","v":""},{"$nulls":11},{"$f":"$AL$48","v":""},"","","","","","","","","","","","","","","",null,"",null,"",null,"1",null,"1"]
[{"$nulls":3},"1",null,"1",null,"1",null,"1",null,"",{"$nulls":14},{"$f":"IF(Y47=\"\",\"\",VLOOKUP(Y47,big_tabela,4,0))","v":""},null,{"$f":"IF(Y47=\"\",\"\",\"anemostat\")","v":""},{"$f":"IF(Y47=\"\",\"\",\"x\"&VLOOKUP(Y47,big_tabela,45,0))","v":""},null,null,{"$f":"IF(AK47=\"\",\"\",VLOOKUP(AK47,big_tabela,4,0))","v":""},null,{"$f":"IF(AK47=\"\",\"\",\"anemostat\")","v":""},{"$f":"IF(AK47=\"\",\"\",\"x\"&VLOOKUP(AK47,big_tabela,44,0))","v":""},{"$nulls":15},"",null,"",null,"",null,"1",null,"1"]
[{"$nulls":3},"1",null,"1",null,"1",null,"1",null,"",{"$nulls":39},"",null,"",null,{"$f":"$AL$34","v":""},null,"1",null,"1"]
[{"$nulls":3},"1",null,"1",null,"1",null,"1",null,"",{"$nulls":39},"",null,"",null,"",null,"1",null,"1"]
[{"$nulls":3},"1",null,"1",null,"1",null,"1",null,"",{"$nulls":12},{"$f":"IF(Obliczenia!E66=\"10\",\"\",Obliczenia!E66)","v":""},{"$nulls":11},{"$f":"IF(Obliczenia!E42=\"10\",\"\",Obliczenia!E42)","v":""},{"$nulls":14},"",null,"",null,"",null,"1",null,"1"]
[{"$nulls":3},"1",null,"1",null,"1",null,"1",null,"",{"$nulls":11},{"$f":"IF(Y54<>\"\",\"1\",\"\")","v":""},null,null,{"$f":"IF(Y54=\"\",\"\",VLOOKUP(Y54,big_tabela,3,0))","v":""},null,{"$f":"IF(Y54=\"\",\"\",VLOOKUP(Y54,big_tabela,12,0))","v":""},"m3/h",null,null,{"$f":"IF(AK54=\"\",\"\",VLOOKUP(AK54,big_tabela,3,0))","v":""},null,{"$f":"IF(AK54=\"\",\"\",VLOOKUP(AK54,big_tabela,12,0))","v":""},"m3/h",null,{"$f":"IF(AK54<>\"\",\"1\",\"\")","v":""},{"$nulls":13},"",null,"",null,"",null,"1",null,"1"]
[{"$nulls":3},"1",null,"1",null,"1",null,"1",null,"",{"$nulls":10},{"$f":"IF(Y54=\"\",\"\",\"Φ75\")","v":""},{"$f":"IF(Y54=\"\",\"\",\"x\"&VLOOKUP(Y54,big_tabela,42,0))","v":""},{"$f":"IF(Y54=\"\",\"\",\"◄\")","v":""},{"$nulls":11},{"$f":"IF(AK54=\"\",\"\",\"◄\")","v":""},{"$f":"IF(AK54=\"\",\"\",\"Φ75\")","v":""},{"$f":"IF(AK54=\"\",\"\",\"x\"&VLOOKUP(AK54,big_tabela,41,0))","v":""},{"$nulls":12},"",null,"",null,"",null,"1",null,"1"]
[{"$nulls":3},"1",null,"1",null,"1",null,"1",null,"",null,{"$f":"$X$55","v":""},"","","","","","","","","","",{"$f":"$X$55","v":""},{"$nulls":11},{"$f":"$AL$55","v":""},"","","","","","","","","","","","","",null,"",null,"",null,"",null,"1",null,"1"]
[{"$nulls":3},"1",null,"1",null,"1",null,"1",null,"",null,"",{"$nulls":12},{"$f":"IF(Y54=\"\",\"\",VLOOKUP(Y54,big_tabela,4,0))","v":""},null,{"$f":"IF(Y54=\"\",\"\",\"anemostat\")","v":""},{"$f":"IF(Y54=\"\",\"\",\"x\"&VLOOKUP(Y54,big_tabela,45,0))","v":""},null,null,{"$f":"IF(AK54=\"\",\"\",VLOOKUP(AK54,big_tabela,4,0))","v":""},null,{"$f":"IF(AK54=\"\",\"\",\"anemostat\")","v":""},{"$f":"IF(AK54=\"\",\"\",\"x\"&VLOOKUP(AK54,big_tabela,44,0))","v":""},{"$nulls":13},"",null,"",null,"",null,"",null,"1",null,"1"]
[{"$nulls":3},"1",null,"1",null,"1",null,{"$f":"$X$41","v":"1"},null,"",null,"",{"$nulls":35},"",null,"",null,{"$f":"$AL$41","v":""},null,"",null,"1",null,"1"]
[{"$nulls":3},"1",null,"1",null,"1",null,"1",null,"",null,"",{"$nulls":35},"",null,"",null,"",null,"",null,"1",null,"1"]
[{"$nulls":3},"1",null,"1",null,"1",null,"1",null,"",null,"",{"$nulls":10},{"$f":"IF(Obliczenia!E67=\"10\",\"\",Obliczenia!E67)","v":""},{"$nulls":11},{"$f":"IF(Obliczenia!E43=\"10\",\"\",Obliczenia!E43)","v":""},{"$nulls":12},"",null,"",null,"",null,"",null,"1",null,"1"]
[{"$nulls":3},"1",null,"1",null,"1",null,"1",null,"",null,"",{"$nulls":9},{"$f":"IF(Y61<>\"\",\"1\",\"\")","v":""},null,null,{"$f":"IF(Y61=\"\",\"\",VLOOKUP(Y61,big_tabela,3,0))","v":""},null,{"$f":"IF(Y61=\"\",\"\",VLOOKUP(Y61,big_tabela,12,0))","v":""},"m3/h",null,null,{"$f":"IF(AK61=\"\",\"\",VLOOKUP(AK61,big_tabela,3,0))","v":""},null,{"$f":"IF(AK61=\"\",\"\",VLOOKUP(AK61,big_tabela,12,0))","v":""},"m3/h",null,{"$f":"IF(AK61<>\"\",\"1\",\"\")","v":""},{"$nulls":11},"",null,"",null,"",null,"",null,"1",null,"1"]
[{"$nulls":3},"1",null,"1",null,"1",null,"1",null,"",null,"",{"$nulls":8},{"$f":"IF(Y61=\"\",\"\",\"Φ75\")","v":""},{"$f":"IF(Y61=\"\",\"\",\"x\"&VLOOKUP(Y61,big_tabela,42,0))","v":""},{"$f":"IF(Y61=\"\",\"\",\"◄\")","v":""},{"$nulls":11},{"$f":"IF(AK61=\"\",\"\",\"◄\")","v":""},{"$f":"IF(AK61=\"\",\"\",\"Φ75\")","v":""},{"$f":"IF(AK61=\"\",\"\",\"x\"&VLOOKUP(AK61,big_tabela,41,0))","v":""},{"$nulls":10},"",null,"",null,"",null,"",null,"1",null,"1"]
[{"$nulls":3},"1",null,"1",null,"1",null,"1",null,"",null,"",null,{"$f":"$X$62","v":""},{"$f":"$X$62","v":""},"","","","","","","","",{"$nulls":11},{"$f":"$AL$62","v":""},"","","","","","","","","","","",null,"",null,"",null,"",null,"",null,"1",null,"1"]
[{"$nulls":3},"1",null,"1",null,"1",null,"1",null,"",null,"",null,{"$f":"$X$62","v":""},{"$nulls":10},{"$f":"IF(Y61=\"\",\"\",VLOOKUP(Y61,big_tabela,4,0))","v":""},null,{"$f":"IF(Y61=\"\",\"\",\"anemostat\")","v":""},{"$f":"IF(Y61=\"\",\"\",\"x\"&VLOOKUP(Y61,big_tabela,45,0))","v":""},null,null,{"$f":"IF(AK61=\"\",\"\",VLOOKUP(AK61,big_tabela,4,0))","v":""},null,{"$f":"IF(AK61=\"\",\"\",\"anemostat\")","v":""},{"$f":"IF(AK61=\"\",\"\",\"x\"&VLOOKUP(AK61,big_tabela,44,0))","v":""},{"$nulls":11},"",null,"",null,"",null,"",null,"",null,"1",null,"1"]
[{"$nulls":3},"1",null,"1",null,"1",null,"1",null,"",null,"",null,"",{"$nulls":31},"",null,"",null,{"$f":"$AL$48","v":""},null,"",null,"",null,"1",null,"1"]
[{"$nulls":3},"1",null,"1",null,"1",null,"1",null,"",null,"",null,"",{"$nulls":31},"",null,"",null,"",null,"",null,"",null,"1",null,"1"]
[{"$nulls":3},"1",null,"1",null,"1",null,"1",null,"",null,"",null,"",{"$nulls":8},{"$f":"IF(Obliczenia!E68=\"10\",\"\",Obliczenia!E68)","v":""},{"$nulls":11},{"$f":"IF(Obliczenia!E44=\"10\",\"\",Obliczenia!E44)","v":""},{"$nulls":10},"",null,"",null,"",null,"",null,"",null,"1",null,"1"]
[{"$nulls":3},"1",null,"1",null,"1",null,"1",null,"",null,"",null,"",{"$nulls":7},{"$f":"IF(Y68<>\"\",\"1\",\"\")","v":""},null,null,{"$f":"IF(Y68=\"\",\"\",VLOOKUP(Y68,big_tabela,3,0))","v":""},null,{"$f":"IF(Y68=\"\",\"\",VLOOKUP(Y68,big_tabela,12,0))","v":""},"m3/h",null,null,{"$f":"IF(AK68=\"\",\"\",VLOOKUP(AK68,big_tabela,3,0))","v":""},null,{"$f":"IF(AK68=\"\",\"\",VLOOKUP(AK68,big_tabela,12,0))","v":""},"m3/h",null,{"$f":"IF(AK68<>\"\",\"1\",\"\")","v":""},{"$nulls":9},"",null,"",null,"",null,"",null,"",null,"1",null,"1"]
[{"$nulls":3},"1",null,"1",null,"1",null,"1",null,"",null,"",null,"",{"$nulls":6},{"$f":"IF(Y68=\"\",\"\",\"Φ75\")","v":""},{"$f":"IF(Y68=\"\",\"\",\"x\"&VLOOKUP(Y68,big_tabela,42,0))","v":""},{"$f":"IF(Y68=\"\",\"\",\"◄\")","v":""},{"$nulls":11},{"$f":"IF(AK68=\"\",\"\",\"◄\")","v":""},{"$f":"IF(AK68=\"\",\"\",\"Φ75\")","v":""},{"$f":"IF(AK68=\"\",\"\",\"x\"&VLOOKUP(AK68,big_tabela,41,0))","v":""},{"$nulls":8},"",null,"",null,"",null,"",null,"",null,"1",null,"1"]
[{"$nulls":3},"1",null,"1",null,"1",null,"1",null,"",null,"",null,"",null,{"$f":"$X$69","v":""},"","","","","","",{"$f":"$X$69","v":""},{"$nulls":11},{"$f":"$AL$69","v":""},"","","","","","","","","",null,"",null,"",null,"",null,"",null,"",null,"1",null,"1"]
[{"$nulls":3},"1",null,"1",null,"1",null,"1",null,"",null,"",null,"",null,"",{"$nulls":8},{"$f":"IF(Y68=\"\",\"\",VLOOKUP(Y68,big_tabela,4,0))","v":""},null,{"$f":"IF(Y68=\"\",\"\",\"anemostat\")","v":""},{"$f":"IF(Y68=\"\",\"\",\"x\"&VLOOKUP(Y68,big_tabela,45,0))","v":""},null,null,{"$f":"IF(AK68=\"\",\"\",VLOOKUP(AK68,big_tabela,4,0))","v":""},null,{"$f":"IF(AK68=\"\",\"\",\"anemostat\")","v":""},{"$f":"IF(AK68=\"\",\"\",\"x\"&VLOOKUP(AK68,big_tabela,44,0))","v":""},{"$nulls":9},"",null,"",null,"",null,"",null,"",null,"",null,"1",null,"1"]
[{"$nulls":3},"1",null,"1",null,"1",null,"1",null,"",null,"",null,"",null,"",{"$nulls":27},"",null,"",null,{"$f":"$AL$55","v":""},null,"",null,"",null,"",null,"1",null,"1"]
[{"$nulls":3},"1",null,"1",null,"1",null,"1",null,"",null,"",null,"",null,"",{"$nulls":27},"",null,"",null,"",null,"",null,"",null,"",null,"1",null,"1"]
[{"$nulls":3},"1",null,"1",null,"1",null,"1",null,"",null,"",null,"",null,"",{"$nulls":6},{"$f":"IF(Obliczenia!E69=\"10\",\"\",Obliczenia!E69)","v":""},{"$nulls":11},{"$f":"IF(Obliczenia!E45=\"10\",\"\",Obliczenia!E45)","v":""},{"$nulls":8},"",null,"",null,"",null,"",null,"",null,"",null,"1",null,"1"]
[{"$nulls":3},"1",null,"1",null,"1",null,"1",null,"",null,"",null,"",null,"",{"$nulls":5},{"$f":"IF(Y75<>\"\",\"1\",\"\")","v":""},null,null,{"$f":"IF(Y75=\"\",\"\",VLOOKUP(Y75,big_tabela,3,0))","v":""},null,{"$f":"IF(Y75=\"\",\"\",VLOOKUP(Y75,big_tabela,12,0))","v":""},"m3/h",null,null,{"$f":"IF(AK75=\"\",\"\",VLOOKUP(AK75,big_tabela,3,0))","v":""},null,{"$f":"IF(AK75=\"\",\"\",VLOOKUP(AK75,big_tabela,12,0))","v":""},"m3/h",null,{"$f":"IF(AK75<>\"\",\"1\",\"\")","v":""},{"$nulls":7},"",null,"",null,"",null,"",null,"",null,"",null,"1",null,"1"]
[{"$nulls":3},"1",null,"1",null,"1",null,"1",null,"",null,"",null,"",null,"",{"$nulls":4},{"$f":"IF(Y75=\"\",\"\",\"Φ75\")","v":""},{"$f":"IF(Y75=\"\",\"\",\"x\"&VLOOKUP(Y75,big_tabela,42,0))","v":""},{"$f":"IF(Y75=\"\",\"\",\"◄\")","v":""},{"$nulls":11},{"$f":"IF(AK75=\"\",\"\",\"◄\")","v":""},{"$f":"IF(AK75=\"\",\"\",\"Φ75\")","v":""},{"$f":"IF(AK75=\"\",\"\",\"x\"&VLOOKUP(AK75,big_tabela,41,0))","v":""},{"$nulls":6},"",null,"",null,"",null,"",null,"",null,"",null,"1",null,"1"]
[{"$nulls":3},"1",null,"1",null,"1",null,"1",null,"",null,"",null,"",null,"",null,{"$f":"$X$76","v":""},"","","","",{"$f":"$X$76","v":""},{"$nulls":11},{"$f":"$AL$76","v":""},{"$f":"$AL$76","v":""},"","","","","","",null,"",null,"",null,"",null,"",null,"",null,"",null,"1",null,"1"]
[{"$nulls":3},"1",null,"1",null,"1",null,"1",null,"",null,"",null,"",null,"",null,"",{"$nulls":6},{"$f":"IF(Y75=\"\",\"\",VLOOKUP(Y75,big_tabela,4,0))","v":""},null,{"$f":"IF(Y75=\"\",\"\",\"anemostat\")","v":""},{"$f":"IF(Y75=\"\",\"\",\"x\"&VLOOKUP(Y75,big_tabela,45,0))","v":""},null,null,{"$f":"IF(AK75=\"\",\"\",VLOOKUP(AK75,big_tabela,4,0))","v":""},null,{"$f":"IF(AK75=\"\",\"\",\"anemostat\")","v":""},{"$f":"IF(AK75=\"\",\"\",\"x\"&VLOOKUP(AK75,big_tabela,44,0))","v":""},{"$nulls":7},"",null,"",null,"",null,"",null,"",null,"",null,"",null,"1",null,"1"]
[{"$nulls":3},"1",null,"1",null,"1",null,"1",null,"",null,"",null,"",null,"",null,"",{"$nulls":23},"",null,"",null,{"$f":"$AL$62","v":""},null,"",null,"",null,"",null,"",null,"1",null,"1"]
[{"$nulls":3},"1",null,"1",null,"1",null,"1",null,"",null,"",null,"",null,"",null,"",{"$nulls":23},"",null,"",null,"",null,"",null,"",null,"",null,"",null,"1",null,"1"]
[{"$nulls":3},"1",null,"1",null,"1",null,"1",null,"",null,"",null,"",null,"",null,"",{"$nulls":4},{"$f":"IF(Obliczenia!E70=\"10\",\"\",Obliczenia!E70)","v":""},{"$nulls":11},{"$f":"IF(Obliczenia!E46=\"10\",\"\",Obliczenia!E46)","v":""},{"$nulls":6},"",null,"",null,"",null,"",null,"",null,"",null,"",null,"1",null,"1"]
[{"$nulls":3},"1",null,"1",null,"1",null,"1",null,"",null,"",null,"",null,"",null,"",{"$nulls":3},{"$f":"IF(Y82<>\"\",\"1\",\"\")","v":""},null,null,{"$f":"IF(Y82=\"\",\"\",VLOOKUP(Y82,big_tabela,3,0))","v":""},null,{"$f":"IF(Y82=\"\",\"\",VLOOKUP(Y82,big_tabela,12,0))","v":""},"m3/h",null,null,{"$f":"IF(AK82=\"\",\"\",VLOOKUP(AK82,big_tabela,3,0))","v":""},null,{"$f":"IF(AK82=\"\",\"\",VLOOKUP(AK82,big_tabela,12,0))","v":""},"m3/h",null,{"$f":"IF(AK82<>\"\",\"1\",\"\")","v":""},{"$nulls":5},"",null,"",null,"",null,"",null,"",null,"",null,"",null,"1",null,"1"]
[{"$nulls":3},"1",null,"1",null,"1",null,"1",null,"",null,"",null,"",null,"",null,"",null,null,{"$f":"IF(Y82=\"\",\"\",\"Φ75\")","v":""},{"$f":"IF(Y82=\"\",\"\",\"x\"&VLOOKUP(Y82,big_tabela,42,0))","v":""},{"$f":"IF(Y82=\"\",\"\",\"◄\")","v":""},{"$nulls":11},{"$f":"IF(AK82=\"\",\"\",\"◄\")","v":""},{"$f":"IF(AK82=\"\",\"\",\"Φ75\")","v":""},{"$f":"IF(AK82=\"\",\"\",\"x\"&VLOOKUP(AK82,big_tabela,41,0))","v":""},{"$nulls":4},"",null,"",null,"",null,"",null,"",null,"",null,"",null,"1",null,"1"]
[{"$nulls":3},"1",null,"1",null,"1",null,"1",null,"",null,"",null,"",null,"",null,"",null,{"$f":"$X$83","v":""},"","",{"$f":"$X$83","v":""},{"$nulls":11},{"$f":"$AL$83","v":""},"","","","","",null,"",null,"",null,"",null,"",null,"",null,"",null,"",null,"1",null,"1"]
[{"$nulls":3},"1",null,"1",null,"1",null,"1",null,"",null,"",null,"",null,"",null,"",null,"",{"$nulls":4},{"$f":"IF(Y82=\"\",\"\",VLOOKUP(Y82,big_tabela,4,0))","v":""},null,{"$f":"IF(Y82=\"\",\"\",\"anemostat\")","v":""},{"$f":"IF(Y82=\"\",\"\",\"x\"&VLOOKUP(Y82,big_tabela,45,0))","v":""},null,null,{"$f":"IF(AK82=\"\",\"\",VLOOKUP(AK82,big_tabela,4,0))","v":""},null,{"$f":"IF(AK82=\"\",\"\",\"anemostat\")","v":""},{"$f":"IF(AK82=\"\",\"\",\"x\"&VLOOKUP(AK82,big_tabela,44,0))","v":""},{"$nulls":5},{"$f":"$AL$83","v":""},null,"",null,"",null,"",null,"",null,"",null,"",null,"",null,"1",null,"1"]
[{"$nulls":3},{"$f":"$X$20","v":"1"},null,"1",null,"1",null,"1",null,"",null,"",null,"",null,"",null,"",null,"",{"$nulls":19},{"$f":"$AL$83","v":""},null,"",null,{"$f":"$AL$69","v":""},null,"",null,"",null,"",null,"",null,"",null,"1",null,"1"]
[{"$nulls":4},{"$f":"Obliczenia!AX31","v":"M 8x75"},{"$nulls":37},{"$f":"Obliczenia!AV31","v":"M 8x75"}]
[{"$nulls":4},{"$f":"IF(E90<>\"\",\"+\",\"\")","v":""},{"$nulls":17},{"$f":"\"  \"&Obliczenia!AQ30&\"x kanał DN75\"","v":"  8x kanał DN75"},{"$nulls":15},{"$f":"Obliczenia!AP30&\"x kanał DN75\"","v":"7x kanał DN75"},{"$nulls":3},{"$f":"IF(AQ90<>\"\",\"+\",\"\")","v":""}]
[{"$nulls":4},{"$f":"Obliczenia!AX34","v":""},{"$nulls":17},{"$f":"IF(Obliczenia!AX29=2,\"! Należy zastosować dwa rozdzielacze lub inną średnicę systemu\",\"\")","v":""},{"$nulls":11},{"$f":"IF(Obliczenia!AV29=2,\"! Należy zastosować dwa rozdzielacze lub inną średnicę systemu\",\"\")","v":""},{"$nulls":7},{"$f":"Obliczenia!AV34","v":""}]
[{"$nulls":15},{"$f":"$X$113","v":""},null,{"$f":"$X$106","v":""},null,{"$f":"$X$99","v":""},null,{"$f":"$X$92","v":""},null,null,{"$f":"IF(Obliczenia!E71=\"10\",\"\",Obliczenia!E71)","v":""},{"$nulls":11},{"$f":"IF(Obliczenia!E47=\"10\",\"\",Obliczenia!E47)","v":""},{"$nulls":4},{"$f":"$AL$92","v":""},null,{"$f":"$AL$99","v":""},null,{"$f":"$AL$106","v":""},null,{"$f":"$AL$113","v":""}]
[{"$nulls":15},"",null,"",null,"",null,"",null,{"$f":"IF(Y91<>\"\",\"1\",\"\")","v":""},null,null,{"$f":"IF(Y91=\"\",\"\",VLOOKUP(Y91,big_tabela,3,0))","v":""},null,{"$f":"IF(Y91=\"\",\"\",VLOOKUP(Y91,big_tabela,12,0))","v":""},"m3/h",null,null,{"$f":"IF(AK91=\"\",\"\",VLOOKUP(AK91,big_tabela,3,0))","v":""},null,{"$f":"IF(AK91=\"\",\"\",VLOOKUP(AK91,big_tabela,12,0))","v":""},"m3/h",null,{"$f":"IF(AK91<>\"\",\"1\",\"\")","v":""},{"$nulls":3},"",null,"",null,"",null,""]
[{"$nulls":15},"",null,"",null,"",null,"",{"$f":"IF(Y91=\"\",\"\",\"Φ75\")","v":""},{"$f":"IF(Y91=\"\",\"\",\"x\"&VLOOKUP(Y91,big_tabela,42,0))","v":""},{"$f":"IF(Y91=\"\",\"\",\"◄\")","v":""},{"$nulls":11},{"$f":"IF(AK91=\"\",\"\",\"◄\")","v":""},{"$f":"IF(AK91=\"\",\"\",\"Φ75\")","v":""},{"$f":"IF(AK91=\"\",\"\",\"x\"&VLOOKUP(AK91,big_tabela,41,0))","v":""},null,null,"",null,"",null,"",null,""]
[{"$nulls":15},"",null,"",null,"",null,"","","",{"$f":"$X$92","v":""},{"$nulls":11},{"$f":"$AL$92","v":""},{"$f":"$AL$92","v":""},{"$f":"$AL$92","v":""},{"$f":"$AL$92","v":""},{"$f":"$AL$92","v":""},"",null,"",null,"",null,""]
[{"$nulls":15},"",null,"",null,"",{"$nulls":6},{"$f":"IF(Y91=\"\",\"\",VLOOKUP(Y91,big_tabela,4,0))","v":""},null,{"$f":"IF(Y91=\"\",\"\",\"anemostat\")","v":""},{"$f":"IF(Y91=\"\",\"\",\"x\"&VLOOKUP(Y91,big_tabela,45,0))","v":""},null,null,{"$f":"IF(AK91=\"\",\"\",VLOOKUP(AK91,big_tabela,4,0))","v":""},null,{"$f":"IF(AK91=\"\",\"\",\"anemostat\")","v":""},{"$f":"IF(AK91=\"\",\"\",\"x\"&VLOOKUP(AK91,big_tabela,44,0))","v":""},{"$nulls":7},"",null,"",null,""]
[{"$nulls":15},"",null,"",null,"",{"$nulls":23},"",null,"",null,""]
[{"$nulls":15},"",null,"",null,"",{"$nulls":23},"",null,"",null,""]
[{"$nulls":15},"",null,"",null,"",{"$nulls":4},{"$f":"IF(Obliczenia!E72=\"10\",\"\",Obliczenia!E72)","v":""},{"$nulls":11},{"$f":"IF(Obliczenia!E48=\"10\",\"\",Obliczenia!E48)","v":""},{"$nulls":6},"",null,"",null,""]
[{"$nulls":15},"",null,"",null,"",{"$nulls":3},{"$f":"IF(Y98<>\"\",\"1\",\"\")","v":""},null,null,{"$f":"IF(Y98=\"\",\"\",VLOOKUP(Y98,big_tabela,3,0))","v":""},null,{"$f":"IF(Y98=\"\",\"\",VLOOKUP(Y98,big_tabela,12,0))","v":""},"m3/h",null,null,{"$f":"IF(AK98=\"\",\"\",VLOOKUP(AK98,big_tabela,3,0))","v":""},null,{"$f":"IF(AK98=\"\",\"\",VLOOKUP(AK98,big_tabela,12,0))","v":""},"m3/h",null,{"$f":"IF(AK98<>\"\",\"1\",\"\")","v":""},{"$nulls":5},"",null,"",null,""]
[{"$nulls":15},"",null,"",null,"",null,null,{"$f":"IF(Y98=\"\",\"\",\"Φ75\")","v":""},{"$f":"IF(Y98=\"\",\"\",\"x\"&VLOOKUP(Y98,big_tabela,42,0))","v":""},{"$f":"IF(Y98=\"\",\"\",\"◄\")","v":""},{"$nulls":11},{"$f":"IF(AK98=\"\",\"\",\"◄\")","v":""},{"$f":"IF(AK98=\"\",\"\",\"Φ75\")","v":""},{"$f":"IF(AK98=\"\",\"\",\"x\"&VLOOKUP(AK98,big_tabela,41,0))","v":""},{"$nulls":4},"",null,"",null,""]
[{"$nulls":15},"",null,"",null,"","","","","",{"$f":"$X$99","v":""},{"$nulls":11},{"$f":"$AL$99","v":""},"","","","","","","",null,"",null,""]
[{"$nulls":15},"",null,"",{"$nulls":8},{"$f":"IF(Y98=\"\",\"\",VLOOKUP(Y98,big_tabela,4,0))","v":""},null,{"$f":"IF(Y98=\"\",\"\",\"anemostat\")","v":""},{"$f":"IF(Y98=\"\",\"\",\"x\"&VLOOKUP(Y98,big_tabela,45,0))","v":""},null,null,{"$f":"IF(AK98=\"\",\"\",VLOOKUP(AK98,big_tabela,4,0))","v":""},null,{"$f":"IF(AK98=\"\",\"\",\"anemostat\")","v":""},{"$f":"IF(AK98=\"\",\"\",\"x\"&VLOOKUP(AK98,big_tabela,44,0))","v":""},{"$nulls":9},"",null,""]
[{"$nulls":15},"",null,"",{"$nulls":27},"",null,""]
[{"$nulls":15},"",null,"",{"$nulls":27},"",null,""]
[{"$nulls":15},"",null,"",{"$nulls":6},{"$f":"IF(Obliczenia!E73=\"10\",\"\",Obliczenia!E73)","v":""},{"$nulls":11},{"$f":"IF(Obliczenia!E49=\"10\",\"\",Obliczenia!E49)","v":""},{"$nulls":8},"",null,""]
[{"$nulls":15},"",null,"",{"$nulls":5},{"$f":"IF(Y105<>\"\",\"1\",\"\")","v":""},null,null,{"$f":"IF(Y105=\"\",\"\",VLOOKUP(Y105,big_tabela,3,0))","v":""},null,{"$f":"IF(Y105=\"\",\"\",VLOOKUP(Y105,big_tabela,12,0))","v":""},"m3/h",null,null,{"$f":"IF(AK105=\"\",\"\",VLOOKUP(AK105,big_tabela,3,0))","v":""},null,{"$f":"IF(AK105=\"\",\"\",VLOOKUP(AK105,big_tabela,12,0))","v":""},"m3/h",null,{"$f":"IF(AK105<>\"\",\"1\",\"\")","v":""},{"$nulls":7},"",null,""]
[{"$nulls":15},"",null,"",{"$nulls":4},{"$f":"IF(Y105=\"\",\"\",\"Φ75\")","v":""},{"$f":"IF(Y105=\"\",\"\",\"x\"&VLOOKUP(Y105,big_tabela,42,0))","v":""},{"$f":"IF(Y105=\"\",\"\",\"◄\")","v":""},{"$nulls":11},{"$f":"IF(AK105=\"\",\"\",\"◄\")","v":""},{"$f":"IF(AK105=\"\",\"\",\"Φ75\")","v":""},{"$f":"IF(AK105=\"\",\"\",\"x\"&VLOOKUP(AK105,big_tabela,41,0))","v":""},{"$nulls":6},"",null,""]
[{"$nulls":15},"",null,"","","","","","","",{"$f":"$X$106","v":""},{"$nulls":11},{"$f":"$AL$106","v":""},"","","","","","","","","",null,""]
[{"$nulls":15},"",{"$nulls":10},{"$f":"IF(Y105=\"\",\"\",VLOOKUP(Y105,big_tabela,4,0))","v":""},null,{"$f":"IF(Y105=\"\",\"\",\"anemostat\")","v":""},{"$f":"IF(Y105=\"\",\"\",\"x\"&VLOOKUP(Y105,big_tabela,45,0))","v":""},null,null,{"$f":"IF(AK105=\"\",\"\",VLOOKUP(AK105,big_tabela,4,0))","v":""},null,{"$f":"IF(AK105=\"\",\"\",\"anemostat\")","v":""},{"$f":"IF(AK105=\"\",\"\",\"x\"&VLOOKUP(AK105,big_tabela,44,0))","v":""},{"$nulls":11},""]
[{"$nulls":15},"",{"$nulls":31},""]
[{"$nulls":15},"",{"$nulls":31},""]
[{"$nulls":15},"",{"$nulls":8},{"$f":"IF(Obliczenia!E74=\"10\",\"\",Obliczenia!E74)","v":""},{"$nulls":11},{"$f":"IF(Obliczenia!E50=\"10\",\"\",Obliczenia!E50)","v":""},{"$nulls":10},""]
[{"$nulls":15},"",{"$nulls":7},{"$f":"IF(Y112<>\"\",\"1\",\"\")","v":""},null,null,{"$f":"IF(Y112=\"\",\"\",VLOOKUP(Y112,big_tabela,3,0))","v":""},null,{"$f":"IF(Y112=\"\",\"\",VLOOKUP(Y112,big_tabela,12,0))","v":""},"m3/h",null,null,{"$f":"IF(AK112=\"\",\"\",VLOOKUP(AK112,big_tabela,3,0))","v":""},null,{"$f":"IF(AK112=\"\",\"\",VLOOKUP(AK112,big_tabela,12,0))","v":""},"m3/h",null,{"$f":"IF(AK112<>\"\",\"1\",\"\")","v":""},{"$nulls":9},""]
[{"$nulls":15},"",{"$nulls":6},{"$f":"IF(Y112=\"\",\"\",\"Φ75\")","v":""},{"$f":"IF(Y112=\"\",\"\",\"x\"&VLOOKUP(Y112,big_tabela,42,0))","v":""},{"$f":"IF(Y112=\"\",\"\",\"◄\")","v":""},{"$nulls":11},{"$f":"IF(AK112=\"\",\"\",\"◄\")","v":""},{"$f":"IF(AK112=\"\",\"\",\"Φ75\")","v":""},{"$f":"IF(AK112=\"\",\"\",\"x\"&VLOOKUP(AK112,big_tabela,41,0))","v":""},{"$nulls":8},""]
[{"$nulls":15},"","","","","","","","","",{"$f":"$X$113","v":""},{"$nulls":11},{"$f":"$AL$113","v":""},"","","","","","","","","","",""]
[{"$nulls":26},{"$f":"IF(Y112=\"\",\"\",VLOOKUP(Y112,big_tabela,4,0))","v":""},null,{"$f":"IF(Y112=\"\",\"\",\"anemostat\")","v":""},{"$f":"IF(Y112=\"\",\"\",\"x\"&VLOOKUP(Y112,big_tabela,45,0))","v":""},null,null,{"$f":"IF(AK112=\"\",\"\",VLOOKUP(AK112,big_tabela,4,0))","v":""},null,{"$f":"IF(AK112=\"\",\"\",\"anemostat\")","v":""},{"$f":"IF(AK112=\"\",\"\",\"x\"&VLOOKUP(AK112,big_tabela,44,0))","v":""}]
[]
[]
[{"$nulls":28},{"$f":"X137","v":"Vitoair FS 300E MA 300m3/h"}]
[]
[]
[{"$nulls":23},{"$f":"\"Kanał zbiorczy 200/174, króciec przyłączeniowy Φ \"&Obliczenia!Y59","v":"Kanał zbiorczy 200/174, króciec przyłączeniowy Φ 160"},{"$nulls":9},{"$f":"\"            Kanał zbiorczy 200/174, króciec przyłączeniowy Φ \"&Obliczenia!Y59","v":"            Kanał zbiorczy 200/174, króciec przyłączeniowy Φ 160"}]
[]
[]
[{"$nulls":23},{"$f":"\"Kanał zbiorczy 200/174, króciec przyłączeniowy Φ \"&Obliczenia!Y59","v":"Kanał zbiorczy 200/174, króciec przyłączeniowy Φ 160"},{"$nulls":9},{"$f":"\"            Kanał zbiorczy 200/174, króciec przyłączeniowy Φ \"&Obliczenia!Y59","v":"            Kanał zbiorczy 200/174, króciec przyłączeniowy Φ 160"}]
[]
[]
[null,null,"Szacunkowy dobór centrali wentylacyjnej i systemu dystrybucji powietrza"]
[]
[]
[]
[]
[{"$nulls":22},"Centrala wentylacyjna"]
[]
[]
[]
[{"$nulls":10},{"$f":"Obliczenia!V84","v":""},{"$nulls":12},"Vitoair FS 300E MA 300m3/h",{"$nulls":4},{"$f":"\"R \"&AC138&\" %\"","v":"R 5 %"},{"$f":"VLOOKUP(X137,rozdzial,4,0)-VLOOKUP(X137,rozdzial,4,0)*(AC138/100)","v":{"v":11948.15,"d":"11,948.15 zł"}},null,null,"Sprawność temperaturowa ErP",{"$nulls":4},{"$f":"VLOOKUP($X$137,Obliczenia!J37:W45,8,0)","v":80},"[%]"]
[{"$nulls":23},{"$f":"IF(X137=\"Vitoair FS 300E MA 300m3/h\",\"Centrala wentylacji mechanicznej z odzyskiem ciepła i wilgoci\",\"Centrala wentylacji mechanicznej z odzyskiem ciepła\")","v":"Centrala wentylacji mechanicznej z odzyskiem ciepła i wilgoci"},{"$nulls":4},5,{"$nulls":3},"Stopień zmiany wilgotności",{"$nulls":4},{"$f":"VLOOKUP($X$137,Obliczenia!J37:W45,9,0)","v":74},"[%]"]
[{"$nulls":23},{"$f":"VLOOKUP(X137,rozdzial,3,0)","v":"Z023297"},{"$nulls":8},"Rodzaj wymiennika ciepła",{"$nulls":4},{"$f":"VLOOKUP($X$137,Obliczenia!J37:W45,11,0)","v":"Krzyżowy, entalpiczny"}]
[{"$nulls":32},"Klapa bypass",{"$nulls":4},{"$f":"VLOOKUP($X$137,Obliczenia!J37:W45,13,0)","v":"Tak"}]
[{"$nulls":23},{"$f":"\"    \"&VLOOKUP($X$137,Obliczenia!J37:W45,6,0)","v":"    39"},{"$f":"VLOOKUP($X$137,Obliczenia!J37:W45,4,0)&\" [m3/h]\"","v":"300 [m3/h]"},null,null,{"$f":"VLOOKUP($X$137,Obliczenia!J37:AA45,16,0)","v":"A"},{"$nulls":4},"Nagrzewnica powietrza zewnęrznego",{"$nulls":4},{"$f":"VLOOKUP($X$137,Obliczenia!J37:W45,14,0)","v":"Opcja 1,8kW"}]
[{"$nulls":27},{"$f":"VLOOKUP($X$137,Obliczenia!J37:AA45,17,0)","v":"A"},{"$nulls":4},"Odpływ kondensatu",{"$nulls":4},{"$f":"VLOOKUP($X$137,Obliczenia!J37:W45,12,0)","v":"Nie"}]
[{"$nulls":27},{"$f":"VLOOKUP($X$137,Obliczenia!J37:AA45,18,0)","v":"A"},{"$nulls":4},"Wymiary zewnętrzne D x W x S",{"$nulls":4},{"$f":"VLOOKUP($X$137,Obliczenia!J37:W45,10,0)","v":"1254 x 244 x 800"},"[mm]"]
[]
[{"$nulls":23},{"$f":"IF(X137=\"Vitoair FS 300E MA 300m3/h\",\"Nagrzewnica elektryczna powietrza 1,8kW\",\"\")","v":"Nagrzewnica elektryczna powietrza 1,8kW"},{"$nulls":5},{"$f":"IFERROR(VLOOKUP(X145,rozdzial,4,0)-VLOOKUP(X145,rozdzial,4,0)*(AC138/100),\"\")","v":{"v":1730.9,"d":"1,730.90 zł"}}]
[{"$nulls":23},{"$f":"IF(X137=\"Vitoair FS 300E MA 300m3/h\",\"Do ogrzewania wstępnego powietrza, montaż wewn. centrali\",\"\")","v":"Do ogrzewania wstępnego powietrza, montaż wewn. centrali"}]
[{"$nulls":23},{"$f":"IFERROR(VLOOKUP(X145,rozdzial,3,0),\"\")","v":7372079}]
[]
[{"$nulls":22},"Sterowanie"]
[]
[]
[]
[{"$nulls":32},"Vitotrol 300-E"]
[{"$nulls":10},{"$f":"Obliczenia!V82","v":"Uwaga! Niewłaściwe dopasowanie sposobu sterowania do wybranej centrali"},{"$nulls":12},"Moduł obsługowy ścienny LB1",{"$nulls":5},{"$f":"IF(X154=\"Sterowanie przez aplikację ViCare\",\"0 zł\",VLOOKUP(X154,rozdzial,4,0)-VLOOKUP(X154,rozdzial,4,0)*(AC138/100))","v":{"v":1506.7,"d":"1,506.70 zł"}},{"$nulls":4},"Radio"]
[{"$nulls":23},"do obsługi zdalnej centrali wentylacyjnej",{"$nulls":8},"Przełącznik\n4-pozycyjny",null,null,"Can-Bus"]
[{"$nulls":23},{"$f":"IF(X154=\"Sterowanie przez aplikację ViCare\",\"\",VLOOKUP(X154,rozdzial,3,0))","v":"Z015318"},{"$nulls":10},"Can-Bus",{"$nulls":4},"ViCare"]
[{"$nulls":34},"Vitoair FS 300E MA",null,"lub Vitocal x5x-A"]
[{"$nulls":23},"",{"$nulls":5},{"$f":"IFERROR(VLOOKUP(X158,rozdzial,4,0)-VLOOKUP(X158,rozdzial,4,0)*(AC138/100),\"\")","v":""},null,null,"Stand Alone",null,null,"  Z pompą ciepła Vitocal z WO1C"]
[{"$nulls":23},{"$f":"IF(X137=\"Vitoair FS 300E MA 300m3/h\",\"Opcja: do komunikacji z pompą ciepłą z regulatorem E3\",IF(X158=\"Przewód komunikacyjny Can-Bus 5m\",\"Uwaga! Nie ma zastosowanie w tym rozwiązaniu\",\"\"))","v":"Opcja: do komunikacji z pompą ciepłą z regulatorem E3"},{"$nulls":8},"bez ViCare App"]
[{"$nulls":23},{"$f":"IFERROR(VLOOKUP(X158,rozdzial,3,0),\"\")","v":""}]
[{"$nulls":32},"Moduł LB1",null,null,"Mod-Bus"]
[{"$nulls":22},"System dystrybucji  //  po stronie pomieszczeń",{"$nulls":16},"ViCare"]
[{"$nulls":34},"       Vitovent 300-W",null,"Vitotronic WO1C"]
[]
[]
[]
[{"$nulls":23},"Skrzynka rozprężna DN125 dla 2 kanałów DN75",{"$nulls":4},{"$f":"Obliczenia!AR30","v":10},{"$f":"VLOOKUP(X167,rozdzial75,4,0)*AC167*(1-$AM$236/100)","v":{"v":1577,"d":"1,577.00 zł"}},{"$nulls":3},{"$f":"'Elementy DN75&90'!D41","v":"Kanał elastyczny okrągły DN75, 50 m"},{"$nulls":3},{"$f":"AK170","v":3},{"$f":"VLOOKUP(AH167,rozdzial75,4,0)*AL167*(1-$AM$236/100)","v":{"v":2758.7999999999997,"d":"2,758.80 zł"}}]
[{"$nulls":23},"Skrzynka rozprężna do mocowania anemostatu",{"$nulls":9},{"$f":"'Elementy DN75&90'!H41","v":"Krąg o długości 50 m, nadrukowane znaczniki długości, powierzchnia antybakteryjna i antystatyczna"}]
[{"$nulls":23},{"$f":"VLOOKUP(X167,rozdzial75,3,0)","v":7377341},{"$f":"VLOOKUP(X167,rozdzial75,4,0)","v":{"v":166,"d":"166.00 zł"}}]
[{"$nulls":33},{"$f":"VLOOKUP(AH167,rozdzial75,3,0)","v":"Z023108"},{"$f":"VLOOKUP(AH167,rozdzial75,4,0)","v":{"v":968,"d":"968.00 zł"}},null,{"$f":"ROUNDUP(AC167*15/50,0)","v":3}]
[]
[{"$nulls":23},{"$f":"'Elementy DN75&90'!D56","v":"Anemostat wywiewny, biały"},{"$nulls":4},{"$f":"Obliczenia!AT30","v":6},{"$f":"VLOOKUP(X172,rozdzial75,4,0)*AC172*(1-$AM$236/100)","v":{"v":541.5,"d":"541.50 zł"}},{"$nulls":3},{"$f":"'Elementy DN75&90'!D55","v":"Anemostat nawiewny, biały"},{"$nulls":3},{"$f":"Obliczenia!AS30","v":4},{"$f":"VLOOKUP(AH172,rozdzial75,4,0)*AL172*(1-$AM$236/100)","v":{"v":406.59999999999997,"d":"406.60 zł"}}]
[{"$nulls":23},"Do wywiewania powietrza z pomieszczenia",{"$nulls":9},"Do nawiewania powietrza świeżego do pomieszczenia"]
[{"$nulls":23},{"$f":"VLOOKUP(X172,rozdzial75,3,0)","v":"ZK04571"},{"$f":"VLOOKUP(X172,rozdzial75,4,0)","v":{"v":95,"d":"95.00 zł"}},{"$nulls":8},{"$f":"VLOOKUP(AH172,rozdzial75,3,0)","v":"ZK04570"},{"$f":"VLOOKUP(AH172,rozdzial75,4,0)","v":{"v":107,"d":"107.00 zł"}}]
[]
[]
[{"$nulls":23},{"$f":"Obliczenia!AW31","v":"Skrzynka rozdzielacza M"},{"$nulls":4},{"$f":"Obliczenia!AX33","v":1},{"$f":"VLOOKUP(X177,'Elementy DN75&90'!D3:H57,4,0)*AC177*(1-$AM$236/100)+AC177*AB180","v":{"v":1177.25,"d":"1,177.25 zł"}},null,null,{"$f":"IF(AL177>0,\"+\",\"\")","v":""},{"$f":"Obliczenia!AW34","v":""},{"$nulls":3},{"$f":"Obliczenia!AX36","v":0},{"$f":"IF(AH177=\"\",0,VLOOKUP(AH177,'Elementy DN75&90'!D3:H55,4,0)*AL177*(1-$AM$236/100)+AL177*AK180)","v":{"v":0,"d":"0.00 zł"}}]
[{"$nulls":23},{"$f":"VLOOKUP(X177,rozdzial75,5,0)","v":"Zintegrowany tłumik hałasów, montaż płyty przyłączeniowej z przodu lub od góry, 470 x 238 x 249"},{"$nulls":9},{"$f":"IF(AH177=\"\",\"\",VLOOKUP(AH177,rozdzial75,5,0))","v":""}]
[]
[{"$nulls":23},{"$f":"VLOOKUP(X177,rozdzial75,3,0)","v":7377375},{"$f":"VLOOKUP(X177,rozdzial75,4,0)","v":{"v":1115,"d":"1,115.00 zł"}},null,{"$f":"IF(Obliczenia!Y59=125,'Elementy DN75&90'!F37,IF(Obliczenia!Y59=160,'Elementy DN75&90'!F38,'Elementy DN75&90'!F39))","v":"ZK01867"},{"$f":"VLOOKUP(AA180,'Elementy DN75&90'!F3:G57,2,0)","v":{"v":118,"d":"118.00 zł"}},{"$nulls":5},{"$f":"IF(AH177=\"\",\"\",VLOOKUP(AH177,rozdzial75,3,0))","v":""},{"$f":"IF(AH177=\"\",\"\",VLOOKUP(AH177,rozdzial75,4,0))","v":""},{"$f":"IF(AH177=\"\",\"\",IF(Obliczenia!Y59=125,'Elementy DN75&90'!F37,IF(Obliczenia!Y59=160,'Elementy DN75&90'!F38,'Elementy DN75&90'!F39)))","v":""},{"$f":"IF(AH177=\"\",\"\",VLOOKUP(AJ180,'Elementy DN75&90'!F3:G57,2,0))","v":""}]
[]
[{"$nulls":23},{"$f":"Obliczenia!AW32","v":"Płyta przyłączeniowa M 8 kanałów DN75"},{"$nulls":4},{"$f":"AC177","v":1},{"$f":"VLOOKUP(X182,'Elementy DN75&90'!D3:H57,4,0)*AC182*(1-$AM$236/100)","v":{"v":817,"d":"817.00 zł"}},null,null,{"$f":"IF(AL182>0,\"+\",\"\")","v":""},{"$f":"Obliczenia!AW35","v":""},{"$nulls":3},{"$f":"AL177","v":0},{"$f":"IF(AH182=\"\",0,VLOOKUP(AH182,'Elementy DN75&90'!D8:H60,4,0)*AL182*(1-$AM$236/100)+AL182*AK185)","v":{"v":0,"d":"0.00 zł"}}]
[{"$nulls":23},{"$f":"VLOOKUP(X182,rozdzial75,5,0)","v":"Do montażu w module skrzynki rozdzielaczowej typu M, w zakresie dostawy 1 korek zaślepiający"},{"$nulls":9},{"$f":"IF(AH182=\"\",\"\",VLOOKUP(AH182,rozdzial75,5,0))","v":""}]
[]
[{"$nulls":23},{"$f":"VLOOKUP(X182,rozdzial75,3,0)","v":7377376},{"$f":"VLOOKUP(X182,rozdzial75,4,0)","v":{"v":860,"d":"860.00 zł"}},{"$nulls":8},{"$f":"IF(AH182=\"\",\"\",VLOOKUP(AH182,rozdzial75,3,0))","v":""},{"$f":"IF(AH182=\"\",\"\",VLOOKUP(AH182,rozdzial75,4,0))","v":""}]
[]
[{"$nulls":23},{"$f":"Obliczenia!AU31","v":"Skrzynka rozdzielacza M"},{"$nulls":4},{"$f":"Obliczenia!AV33","v":1},{"$f":"VLOOKUP(X187,'Elementy DN75&90'!D13:H67,4,0)*AC187*(1-$AM$236/100)+AC187*AB190","v":{"v":1177.25,"d":"1,177.25 zł"}},null,null,{"$f":"IF(AL187>0,\"+\",\"\")","v":""},{"$f":"Obliczenia!AU34","v":""},{"$nulls":3},{"$f":"Obliczenia!AV36","v":0},{"$f":"IF(AH187=\"\",0,VLOOKUP(AH187,'Elementy DN75&90'!D13:H65,4,0)*AL187*(1-$AM$236/100)+AL187*AK190)","v":{"v":0,"d":"0.00 zł"}}]
[{"$nulls":23},{"$f":"VLOOKUP(X187,rozdzial75,5,0)","v":"Zintegrowany tłumik hałasów, montaż płyty przyłączeniowej z przodu lub od góry, 470 x 238 x 249"},{"$nulls":9},{"$f":"IF(AH187=\"\",\"\",VLOOKUP(AH187,rozdzial75,5,0))","v":""}]
[]
[{"$nulls":23},{"$f":"VLOOKUP(X187,rozdzial75,3,0)","v":7377375},{"$f":"VLOOKUP(X187,rozdzial75,4,0)","v":{"v":1115,"d":"1,115.00 zł"}},null,{"$f":"IF(Obliczenia!Y59=125,'Elementy DN75&90'!F37,IF(Obliczenia!Y59=160,'Elementy DN75&90'!F38,'Elementy DN75&90'!F39))","v":"ZK01867"},{"$f":"VLOOKUP(AA190,'Elementy DN75&90'!F13:G67,2,0)","v":{"v":118,"d":"118.00 zł"}},{"$nulls":5},{"$f":"IF(AH187=\"\",\"\",VLOOKUP(AH187,rozdzial75,3,0))","v":""},{"$f":"IF(AH187=\"\",\"\",VLOOKUP(AH187,rozdzial75,4,0))","v":""},{"$f":"IF(AH187=\"\",\"\",IF(Obliczenia!Y69=125,'Elementy DN75&90'!F47,IF(Obliczenia!Y69=160,'Elementy DN75&90'!F48,'Elementy DN75&90'!F49)))","v":""},{"$f":"IF(AH187=\"\",\"\",VLOOKUP(AJ190,'Elementy DN75&90'!F13:G67,2,0))","v":""}]
[]
[{"$nulls":23},{"$f":"Obliczenia!AU32","v":"Płyta przyłączeniowa M 8 kanałów DN75"},{"$nulls":4},{"$f":"AC187","v":1},{"$f":"VLOOKUP(X192,'Elementy DN75&90'!D13:H67,4,0)*AC192*(1-$AM$236/100)","v":{"v":817,"d":"817.00 zł"}},null,null,{"$f":"IF(AL192>0,\"+\",\"\")","v":""},{"$f":"Obliczenia!AU35","v":""},{"$nulls":3},{"$f":"AL187","v":0},{"$f":"IF(AH192=\"\",0,VLOOKUP(AH192,'Elementy DN75&90'!D18:H70,4,0)*AL192*(1-$AM$236/100)+AL192*AK195)","v":{"v":0,"d":"0.00 zł"}}]
[{"$nulls":23},{"$f":"VLOOKUP(X192,rozdzial75,5,0)","v":"Do montażu w module skrzynki rozdzielaczowej typu M, w zakresie dostawy 1 korek zaślepiający"},{"$nulls":9},{"$f":"IF(AH192=\"\",\"\",VLOOKUP(AH192,rozdzial75,5,0))","v":""}]
[]
[{"$nulls":23},{"$f":"VLOOKUP(X192,rozdzial75,3,0)","v":7377376},{"$f":"VLOOKUP(X192,rozdzial75,4,0)","v":{"v":860,"d":"860.00 zł"}},{"$nulls":8},{"$f":"IF(AH192=\"\",\"\",VLOOKUP(AH192,rozdzial75,3,0))","v":""},{"$f":"IF(AH192=\"\",\"\",VLOOKUP(AH192,rozdzial75,4,0))","v":""}]
[]
[{"$nulls":22},"System dystrybucji  //  po stronie zewnętrznej"]
[]
[]
[]
[{"$nulls":23},"Kanał izolowany 200/174",{"$nulls":4},{"$f":"AB203","v":4},{"$f":"VLOOKUP(X201,rozdzial,4,0)*AC201*(1-$AM$236/100)","v":{"v":1504.8,"d":"1,504.80 zł"}},{"$nulls":3},"Kolano izolowane z mufą 90 stopni",{"$nulls":3},{"$f":"AK203","v":4},{"$f":"VLOOKUP(AH201,rozdzial,4,0)*AL201*(1-$AM$236/100)","v":{"v":680.1999999999999,"d":"680.20 zł"}}]
[{"$nulls":23},"1 sztuka = 2 m długości, przepływ maksymalny 400 m3/h",{"$nulls":9},"Do zmiany kierunku kanałów izolowanych 200/174"]
[{"$nulls":23},{"$f":"VLOOKUP(X201,rozdzial,3,0)","v":7546070},{"$f":"VLOOKUP(X201,rozdzial,4,0)","v":{"v":396,"d":"396.00 zł"}},null,null,4,{"$nulls":5},{"$f":"VLOOKUP(AH201,rozdzial,3,0)","v":7546071},{"$f":"VLOOKUP(AH201,rozdzial,4,0)","v":{"v":179,"d":"179.00 zł"}},null,4]
[]
[]
[{"$nulls":23},"Czerpnia/wyrzutnia ścienna z rurą",{"$nulls":4},2,{"$f":"VLOOKUP(X206,rozdzial,4,0)*AC206*(1-$AM$236/100)","v":{"v":568.1,"d":"568.10 zł"}},{"$nulls":3},{"$f":"IF(Obliczenia!Y57=\"Vitovent 300-W 325m3/h lewa\",\"Mufa/redukcja 200/150\",IF(Obliczenia!Y57=\"Vitovent 300-W 325m3/h prawa\",\"Mufa/redukcja 200/150\",IF(Obliczenia!Y57=\"Vitovent 300-W 400m3/h lewa\",\"Mufa/redukcja 200/180\",IF(Obliczenia!Y57=\"Vitovent 300-W 400m3/h prawa\",\"Mufa/redukcja 200/180\",IF(Obliczenia!Y57=\"Vitovent 300-W 225m3/h lewa\",\"Mufa/redukcja 200/125\",IF(Obliczenia!Y57=\"Vitovent 300-W 225m3/h prawa\",\"Mufa/redukcja 200/125\",\"Mufa/redukcja 200/150\"))))))","v":"Mufa/redukcja 200/150"},{"$nulls":3},4,{"$f":"VLOOKUP(AH206,rozdzial,4,0)*AL206*(1-$AM$236/100)","v":{"v":288.8,"d":"288.80 zł"}}]
[{"$nulls":23},"Do bezpośredniego podłączenia kanału izolowanego 200/174",{"$nulls":9},"Do przyłączenia kanału 200/174 do króćców centrali"]
[{"$nulls":23},{"$f":"VLOOKUP(X206,rozdzial,3,0)","v":7663729},{"$f":"VLOOKUP(X206,rozdzial,4,0)","v":{"v":299,"d":"299.00 zł"}},{"$nulls":8},{"$f":"VLOOKUP(AH206,rozdzial,3,0)","v":7546075},{"$f":"VLOOKUP(AH206,rozdzial,4,0)","v":{"v":76,"d":"76.00 zł"}}]
[]
[{"$nulls":37},1]
[]
[]
[]
[]
[]
[{"$nulls":22},"Elementy uzupełniające"]
[]
[]
[]
[{"$nulls":23},{"$f":"'Elementy DN75&90'!D57","v":"Nóż do cięcia kanałów płaskich i okrągłych"},{"$nulls":4},0,{"$f":"VLOOKUP(X220,rozdzial75,4,0)*AC220*(1-$AM$236/100)","v":{"v":0,"d":"0.00 zł"}},{"$nulls":3},{"$f":"'Elementy DN75&90'!D44","v":"Łącznik kanałów DN75"},{"$nulls":3},0,{"$f":"VLOOKUP(AH220,rozdzial75,4,0)*AL220*(1-$AM$236/100)","v":{"v":0,"d":"0.00 zł"}}]
[{"$nulls":23},"Do szybkiego i precyzyjnego obcinania rur",{"$nulls":9},"Do szczelnego łączenia kanałów elastycznych DN63"]
[{"$nulls":23},{"$f":"VLOOKUP(X220,rozdzial75,3,0)","v":7372852},{"$f":"VLOOKUP(X220,rozdzial75,4,0)","v":{"v":319,"d":"319.00 zł"}},{"$nulls":8},{"$f":"VLOOKUP(AH220,rozdzial75,3,0)","v":7372825},{"$f":"VLOOKUP(AH220,rozdzial75,4,0)","v":{"v":66,"d":"66.00 zł"}}]
[]
[]
[{"$nulls":23},"Kolano izolowane z mufą 45 stopni",{"$nulls":4},0,{"$f":"VLOOKUP(X225,rozdzial,4,0)*AC225*(1-$AM$236/100)","v":{"v":0,"d":"0.00 zł"}},{"$nulls":3},{"$f":"'Elementy DN75&90'!D46","v":"Kolano 90, DN75"},{"$nulls":3},0,{"$f":"VLOOKUP(AH225,rozdzial75,4,0)*AL225*(1-$AM$236/100)","v":{"v":0,"d":"0.00 zł"}}]
[{"$nulls":23},"Do zmiany kierunku kanałów izolowanych 200/174",{"$nulls":9},{"$f":"'Elementy DN75&90'!H46","v":"Do zmiany kierunki w ciasnych miejscach, możliwość przycięcia i podłączenia wrost do rozdzielacza"}]
[{"$nulls":23},{"$f":"VLOOKUP(X225,rozdzial,3,0)","v":7546072},{"$f":"VLOOKUP(X225,rozdzial,4,0)","v":{"v":131,"d":"131.00 zł"}}]
[{"$nulls":33},{"$f":"VLOOKUP(AH225,rozdzial75,3,0)","v":7372923},{"$f":"VLOOKUP(AH225,rozdzial75,4,0)","v":{"v":135,"d":"135.00 zł"}}]
[]
[{"$nulls":23},"Mufa łącząca 200/200",{"$nulls":4},0,{"$f":"VLOOKUP(X230,rozdzial,4,0)*AC230*(1-$AM$236/100)","v":{"v":0,"d":"0.00 zł"}},{"$nulls":3},"Trójnik izolowany 200/174 bez mufy",{"$nulls":3},{"$f":"AK232","v":0},{"$f":"VLOOKUP(AH230,rozdzial,4,0)*AL230*(1-$AM$236/100)","v":{"v":0,"d":"0.00 zł"}}]
[{"$nulls":33},"Do rozdzielenia kanału izolowanego 200/174"]
[{"$nulls":23},{"$f":"VLOOKUP(X230,rozdzial,3,0)","v":7546073},{"$f":"VLOOKUP(X230,rozdzial,4,0)","v":{"v":61,"d":"61.00 zł"}},{"$nulls":8},{"$f":"VLOOKUP(AH230,rozdzial,3,0)","v":7775845},{"$f":"VLOOKUP(AH230,rozdzial,4,0)","v":{"v":800,"d":"800.00 zł"}},null,{"$f":"AL177+AL187","v":0}]
[{"$nulls":38},1]
[]
[null,null,{"$f":"Dane!S241","v":"Autor:"},{"$nulls":4},{"$f":"Dane!T241","v":"PanD, 2023"},{"$nulls":27},"Cena:",{"$f":"AD137+IFERROR(VLOOKUP(X145,rozdzial,4,0),0)+AD154+IFERROR(VLOOKUP(X158,rozdzial,4,0),0)+AD167+AM167+AM172+AD172+AD177+AM177+AD182+AD201+AD206+AM201+AM206+AD220+AM220+AD225+AM225+AM182+AD230+AM230+AD187+AD192+AM187+AM192","v":{"v":27591.149999999994,"d":"27,591.15 zł"}},null,{"$f":"\"R \"&AM236&\" %\"","v":"R 5 %"},null,"(rabat na system)"]
[{"$nulls":38},5]
[]
[{"$nulls":40},{"$f":"IF(Obliczenia!AP10<>0,Obliczenia!AP10,\"\")","v":""}]
[]
[{"$nulls":40},{"$f":"IF(Obliczenia!AP11<>0,Obliczenia!AP11,\"\")","v":3}]
[]
[{"$nulls":40},{"$f":"IF(Obliczenia!AP12<>0,Obliczenia!AP12,\"\")","v":4}]
[]
[{"$nulls":40},{"$f":"IF(Obliczenia!AP13<>0,Obliczenia!AP13,\"\")","v":""}]
[]
[]
[]
[]
[]
[]
[{"$nulls":40},{"$f":"IF(Obliczenia!AP14<>0,Obliczenia!AP14,\"\")","v":""}]
[{"$nulls":40},{"$f":"IF(Obliczenia!AP15<>0,Obliczenia!AP15,\"\")","v":""}]
[{"$nulls":40},{"$f":"IF(Obliczenia!AP16<>0,Obliczenia!AP16,\"\")","v":""}]
[{"$nulls":40},{"$f":"IF(Obliczenia!AP17<>0,Obliczenia!AP17,\"\")","v":""}]
[{"$nulls":40},{"$f":"IF(Obliczenia!AP18<>0,Obliczenia!AP18,\"\")","v":""}]

{"sheet":"System DN90","index":3,"n_rows":255,"n_cols":60,"rows_kept":255,"merged":[[0,37,0,38],[2,35,3,35],[2,36,3,37],[2,38,3,46],[7,2,8,35],[10,2,11,28],[16,25,16,29],[16,31,16,35],[18,24,19,24],[18,36,19,36],[19,26,20,27],[19,28,20,28],[19,29,20,29],[19,32,20,33],[19,34,20,34],[19,35,20,35],[25,24,26,24],[25,36,26,36],[26,26,27,27],[26,28,27,28],[26,29,27,29],[26,32,27,33],[26,34,27,34],[26,35,27,35],[32,24,33,24],[32,36,33,36],[33,26,34,27],[33,28,34,28],[33,29,34,29],[33,32,34,33],[33,34,34,34],[33,35,34,35],[39,24,40,24],[39,36,40,36],[40,26,41,27],[40,28,41,28],[40,29,41,29],[40,32,41,33],[40,34,41,34],[40,35,41,35],[46,24,47,24],[46,36,47,36],[47,26,48,27],[47,28,48,28],[47,29,48,29],[47,32,48,33],[47,34,48,34],[47,35,48,35],[53,24,54,24],[53,36,54,36],[54,26,55,27],[54,28,55,28],[54,29,55,29],[54,32,55,33],[54,34,55,34],[54,35,55,35],[60,24,61,24],[60,36,61,36],[61,26,62,27],[61,28,62,28],[61,29,62,29],[61,32,62,33],[61,34,62,34],[61,35,62,35],[67,24,68,24],[67,36,68,36],[68,26,69,27],[68,28,69,28],[68,29,69,29],[68,32,69,33],[68,34,69,34],[68,35,69,35],[74,24,75,24],[74,36,75,36],[75,26,76,27],[75,28,76,28],[75,29,76,29],[75,32,76,33],[75,34,76,34],[75,35,76,35],[81,24,82,24],[81,36,82,36],[82,26,83,27],[82,28,83,28],[82,29,83,29],[82,32,83,33],[82,34,83,34],[82,35,83,35],[87,4,87,20],[87,42,87,58],[88,4,88,20],[88,38,88,40],[88,42,88,58],[89,4,89,20],[89,34,89,40],[89,42,89,58],[90,24,91,24],[90,36,91,36],[91,26,92,27],[91,28,92,28],[91,29,92,29],[91,32,92,33],[91,34,92,34],[91,35,92,35],[97,24,98,24],[97,36,98,36],[98,26,99,27],[98,28,99,28],[98,29,99,29],[98,32,99,33],[98,34,99,34],[98,35,99,35],[104,24,105,24],[104,36,105,36],[105,26,106,27],[105,28,106,28],[105,29,106,29],[105,32,106,33],[105,34,106,34],[105,35,106,35],[111,24,112,24],[111,36,112,36],[112,26,113,27],[112,28,113,28],[112,29,113,29],[112,32,113,33],[112,34,113,34],[112,35,113,35],[118,28,118,33],[127,2,128,39],[132,22,133,25],[136,10,138,22],[136,23,136,27],[136,29,136,30],[144,23,144,27],[144,29,144,30],[148,22,149,27],[153,10,158,22],[153,23,153,27],[153,29,153,30],[154,32,155,32],[154,35,154,36],[156,34,156,35],[157,23,157,27],[157,29,157,30],[160,35,160,36],[161,22,163,27],[162,36,162,37],[166,28,167,28],[166,29,166,30],[166,37,167,37],[166,38,166,39],[167,33,168,36],[171,28,172,28],[171,29,171,30],[171,37,172,37],[171,38,171,39],[176,28,177,28],[176,29,176,30],[176,32,179,32],[176,37,177,37],[176,38,176,39],[177,23,178,27],[177,33,178,36],[181,28,182,28],[181,29,181,30],[181,32,184,32],[181,37,182,37],[181,38,181,39],[182,23,183,27],[182,33,183,36],[186,28,187,28],[186,29,186,30],[186,32,189,32],[186,37,187,37],[186,38,186,39],[187,23,188,27],[187,33,188,36],[191,28,192,28],[191,29,191,30],[191,32,194,32],[191,37,192,37],[191,38,191,39],[192,23,193,27],[192,33,193,36],[196,22,197,27],[200,28,201,28],[200,29,200,30],[200,37,201,37],[200,38,200,39],[205,28,206,28],[205,29,205,30],[205,37,206,37],[205,38,205,39],[210,28,211,28],[210,29,210,30],[215,22,216,26],[219,28,220,28],[219,29,219,30],[219,37,220,37],[219,38,219,39],[224,2,224,5],[224,28,225,28],[224,29,224,30],[224,37,225,37],[224,38,224,39],[225,33,226,36],[229,28,230,28],[229,29,229,30],[229,37,230,37],[229,38,229,39],[234,36,234,37]]}
[{"$nulls":29},"R system",{"$f":"AM236/100","v":{"v":0.05,"d":"5%"}},null,"R centrala",{"$f":"AC138/100","v":{"v":0.05,"d":"5%"}},null,null,"Suma",{"$f":"AK235","v":{"v":27049.750000000004,"d":"27,049.75 zł"}}]
[]
[{"$nulls":35},"Data:   ",{"$f":"TODAY()","v":"2023-10-25"},null,{"$f":"Dane!S3","v":"wersja 23/10/2023"}]
[]
[]
[]
[]
[null,null,"System dystrybucji powietrza  |  okrągły Φ90"]
[]
[]
[null,null,"Uproszczony schemat instalacji"]
[]
[]
[]
[]
[]
[{"$nulls":25},"Powietrze wywiewane",{"$nulls":5},"Powietrze nawiewane"]
[]
[{"$nulls":24},{"$f":"IF(Obliczenia!E61=\"10\",\"\",Obliczenia!E61)","v":"0.1"},{"$nulls":11},{"$f":"IF(Obliczenia!E37=\"10\",\"\",Obliczenia!E37)","v":"0.5"}]
[{"$nulls":23},{"$f":"IF(Y19<>\"\",\"1\",\"\")","v":"1"},null,null,{"$f":"IF(Y19=\"\",\"\",VLOOKUP(Y19,big_tabela,3,0))","v":"Wiatrołap"},null,{"$f":"IF(Y19=\"\",\"\",VLOOKUP(Y19,big_tabela,12,0))","v":25},"m3/h",null,null,{"$f":"IF(AK19=\"\",\"\",VLOOKUP(AK19,big_tabela,3,0))","v":"Salon"},null,{"$f":"IF(AK19=\"\",\"\",VLOOKUP(AK19,big_tabela,12,0))","v":120},"m3/h",null,{"$f":"IF(AK19<>\"\",\"1\",\"\")","v":"1"}]
[{"$nulls":22},{"$f":"IF(Y19=\"\",\"\",\"Φ90\")","v":"Φ90"},{"$f":"IF(Y19=\"\",\"\",\"x\"&VLOOKUP(Y19,big_tabela,53,0))","v":"x1"},{"$f":"IF(Y19=\"\",\"\",\"◄\")","v":"◄"},{"$nulls":11},{"$f":"IF(AK19=\"\",\"\",\"◄\")","v":"◄"},{"$f":"IF(AK19=\"\",\"\",\"Φ90\")","v":"Φ90"},{"$f":"IF(AK19=\"\",\"\",\"x\"&VLOOKUP(AK19,big_tabela,52,0))","v":"x3"}]
[{"$nulls":3},{"$f":"$X$20","v":"1"},{"$f":"$X$20","v":"1"},{"$f":"$X$20","v":"1"},"1","1","1","1","1","1","1","1","1","1","1","1","1","1","1","1","1","1","1",{"$nulls":11},{"$f":"$AL$20","v":"1"},{"$f":"$AL$20","v":"1"},"1","1","1","1","1","1","1","1","1","1","1","1","1","1","1","1","1","1","1","1","1","1"]
[{"$nulls":3},{"$f":"$X$20","v":"1"},{"$nulls":22},{"$f":"IF(Y19=\"\",\"\",VLOOKUP(Y19,big_tabela,4,0))","v":"0.1 Wiatrołap"},null,{"$f":"IF(Y19=\"\",\"\",\"anemostat\")","v":"anemostat"},{"$f":"IF(Y19=\"\",\"\",\"x\"&VLOOKUP(Y19,big_tabela,56,0))","v":"x1"},null,null,{"$f":"IF(AK19=\"\",\"\",VLOOKUP(AK19,big_tabela,4,0))","v":"0.6 Salon"},null,{"$f":"IF(AK19=\"\",\"\",\"anemostat\")","v":"anemostat"},{"$f":"IF(AK19=\"\",\"\",\"x\"&VLOOKUP(AK19,big_tabela,55,0))","v":"x3"},{"$nulls":23},"1"]
[{"$nulls":3},"1",{"$nulls":55},"1"]
[{"$nulls":3},"1",{"$nulls":55},"1"]
[{"$nulls":3},"1",{"$nulls":20},{"$f":"IF(Obliczenia!E62=\"10\",\"\",Obliczenia!E62)","v":"0.6"},{"$nulls":11},{"$f":"IF(Obliczenia!E38=\"10\",\"\",Obliczenia!E38)","v":"0.4"},{"$nulls":22},"1"]
[{"$nulls":3},"1",{"$nulls":19},{"$f":"IF(Y26<>\"\",\"1\",\"\")","v":"1"},null,null,{"$f":"IF(Y26=\"\",\"\",VLOOKUP(Y26,big_tabela,3,0))","v":"Spiżarnia"},null,{"$f":"IF(Y26=\"\",\"\",VLOOKUP(Y26,big_tabela,12,0))","v":25},"m3/h",null,null,{"$f":"IF(AK26=\"\",\"\",VLOOKUP(AK26,big_tabela,3,0))","v":"Jadalnia - nawiew"},null,{"$f":"IF(AK26=\"\",\"\",VLOOKUP(AK26,big_tabela,12,0))","v":80},"m3/h",null,{"$f":"IF(AK26<>\"\",\"1\",\"\")","v":"1"},{"$nulls":21},"1"]
[{"$nulls":3},"1",{"$nulls":18},{"$f":"IF(Y26=\"\",\"\",\"Φ90\")","v":"Φ90"},{"$f":"IF(Y26=\"\",\"\",\"x\"&VLOOKUP(Y26,big_tabela,53,0))","v":"x1"},{"$f":"IF(Y26=\"\",\"\",\"◄\")","v":"◄"},{"$nulls":11},{"$f":"IF(AK26=\"\",\"\",\"◄\")","v":"◄"},{"$f":"IF(AK26=\"\",\"\",\"Φ90\")","v":"Φ90"},{"$f":"IF(AK26=\"\",\"\",\"x\"&VLOOKUP(AK26,big_tabela,52,0))","v":"x2"},{"$nulls":20},"1"]
[{"$nulls":3},"1",null,{"$f":"$X$27","v":"1"},"1","1","1","1","1","1","1","1","1","1","1","1","1","1","1","1","1","1",{"$f":"$X$27","v":"1"},{"$nulls":11},{"$f":"$AL$27","v":"1"},{"$f":"$AL$27","v":"1"},"1","1","1","1","1","1","1","1","1","1","1","1","1","1","1","1","1","1","1","1",null,"1"]
[{"$nulls":3},"1",null,"1",{"$nulls":20},{"$f":"IF(Y26=\"\",\"\",VLOOKUP(Y26,big_tabela,4,0))","v":"04.a Spiżarnia"},null,{"$f":"IF(Y26=\"\",\"\",\"anemostat\")","v":"anemostat"},{"$f":"IF(Y26=\"\",\"\",\"x\"&VLOOKUP(Y26,big_tabela,56,0))","v":"x1"},null,null,{"$f":"IF(AK26=\"\",\"\",VLOOKUP(AK26,big_tabela,4,0))","v":"0.5 Jadalnia"},null,{"$f":"IF(AK26=\"\",\"\",\"anemostat\")","v":"anemostat"},{"$f":"IF(AK26=\"\",\"\",\"x\"&VLOOKUP(AK26,big_tabela,55,0))","v":"x2"},{"$nulls":21},"1",null,"1"]
[{"$nulls":3},"1",null,"1",{"$nulls":51},"1",null,"1"]
[{"$nulls":3},"1",null,"1",{"$nulls":51},"1",null,"1"]
[{"$nulls":3},"1",null,"1",{"$nulls":18},{"$f":"IF(Obliczenia!E63=\"10\",\"\",Obliczenia!E63)","v":"0.2"},{"$nulls":11},{"$f":"IF(Obliczenia!E39=\"10\",\"\",Obliczenia!E39)","v":""},{"$nulls":20},"1",null,"1"]
[{"$nulls":3},"1",null,"1",1,{"$nulls":16},{"$f":"IF(Y33<>\"\",\"1\",\"\")","v":"1"},null,null,{"$f":"IF(Y33=\"\",\"\",VLOOKUP(Y33,big_tabela,3,0))","v":"Łazienka"},null,{"$f":"IF(Y33=\"\",\"\",VLOOKUP(Y33,big_tabela,12,0))","v":75},"m3/h",null,null,{"$f":"IF(AK33=\"\",\"\",VLOOKUP(AK33,big_tabela,3,0))","v":""},null,{"$f":"IF(AK33=\"\",\"\",VLOOKUP(AK33,big_tabela,12,0))","v":""},"m3/h",null,{"$f":"IF(AK33<>\"\",\"1\",\"\")","v":""},{"$nulls":19},"1",null,"1"]
[{"$nulls":3},"1",null,"1",{"$nulls":16},{"$f":"IF(Y33=\"\",\"\",\"Φ90\")","v":"Φ90"},{"$f":"IF(Y33=\"\",\"\",\"x\"&VLOOKUP(Y33,big_tabela,53,0))","v":"x2"},{"$f":"IF(Y33=\"\",\"\",\"◄\")","v":"◄"},{"$nulls":11},{"$f":"IF(AK33=\"\",\"\",\"◄\")","v":""},{"$f":"IF(AK33=\"\",\"\",\"Φ90\")","v":""},{"$f":"IF(AK33=\"\",\"\",\"x\"&VLOOKUP(AK33,big_tabela,52,0))","v":""},{"$nulls":18},"1",null,"1"]
[{"$nulls":3},"1",null,"1",null,{"$f":"$X$34","v":"1"},"1","1","1","1","1","1","1","1","1","1","1","1","1","1","1",{"$f":"$X$34","v":"1"},{"$f":"$X$34","v":"1"},{"$nulls":11},{"$f":"$AL$34","v":""},{"$f":"$AL$34","v":""},"","","","","","","","","","","","","","","","","","",null,"1",null,"1"]
[{"$nulls":3},"1",null,"1",null,"1",{"$nulls":18},{"$f":"IF(Y33=\"\",\"\",VLOOKUP(Y33,big_tabela,4,0))","v":"03. Łazienka"},null,{"$f":"IF(Y33=\"\",\"\",\"anemostat\")","v":"anemostat"},{"$f":"IF(Y33=\"\",\"\",\"x\"&VLOOKUP(Y33,big_tabela,56,0))","v":"x2"},null,null,{"$f":"IF(AK33=\"\",\"\",VLOOKUP(AK33,big_tabela,4,0))","v":""},null,{"$f":"IF(AK33=\"\",\"\",\"anemostat\")","v":""},{"$f":"IF(AK33=\"\",\"\",\"x\"&VLOOKUP(AK33,big_tabela,55,0))","v":""},{"$nulls":19},"",null,"1",null,"1"]
[{"$nulls":3},"1",null,"1",null,"1",{"$nulls":47},"",null,"1",null,{"$f":"$AL$20","v":"1"}]
[{"$nulls":3},"1",null,"1",null,"1",{"$nulls":47},"",null,"1",null,"1"]
[{"$nulls":3},"1",null,"1",null,"1",{"$nulls":16},{"$f":"IF(Obliczenia!E64=\"10\",\"\",Obliczenia!E64)","v":"0.3"},{"$nulls":11},{"$f":"IF(Obliczenia!E40=\"10\",\"\",Obliczenia!E40)","v":""},{"$nulls":18},"",null,"1",null,"1"]
[{"$nulls":3},"1",null,"1",null,"1",{"$nulls":15},{"$f":"IF(Y40<>\"\",\"1\",\"\")","v":"1"},null,null,{"$f":"IF(Y40=\"\",\"\",VLOOKUP(Y40,big_tabela,3,0))","v":"Kuchnia otwarta z kuchenką elektryczną"},null,{"$f":"IF(Y40=\"\",\"\",VLOOKUP(Y40,big_tabela,12,0))","v":75},"m3/h",null,null,{"$f":"IF(AK40=\"\",\"\",VLOOKUP(AK40,big_tabela,3,0))","v":""},null,{"$f":"IF(AK40=\"\",\"\",VLOOKUP(AK40,big_tabela,12,0))","v":""},"m3/h",null,{"$f":"IF(AK40<>\"\",\"1\",\"\")","v":""},{"$nulls":17},"",null,"1",null,"1"]
[{"$nulls":3},"1",null,"1",null,"1",{"$nulls":14},{"$f":"IF(Y40=\"\",\"\",\"Φ90\")","v":"Φ90"},{"$f":"IF(Y40=\"\",\"\",\"x\"&VLOOKUP(Y40,big_tabela,53,0))","v":"x2"},{"$f":"IF(Y40=\"\",\"\",\"◄\")","v":"◄"},{"$nulls":11},{"$f":"IF(AK40=\"\",\"\",\"◄\")","v":""},{"$f":"IF(AK40=\"\",\"\",\"Φ90\")","v":""},{"$f":"IF(AK40=\"\",\"\",\"x\"&VLOOKUP(AK40,big_tabela,52,0))","v":""},{"$nulls":16},"",null,"1",null,"1"]
[{"$nulls":3},"1",null,"1",null,"1",null,{"$f":"$X$41","v":"1"},"1","1","1","1","1","1","1","1","1","1","1","1","1","1",{"$f":"$X$41","v":"1"},{"$nulls":11},{"$f":"$AL$41","v":""},{"$f":"$AL$41","v":""},"","","","","","","","","","","","","","","","",null,"",null,"1",null,"1"]
[{"$nulls":3},"1",null,"1",null,"1",null,"1",{"$nulls":16},{"$f":"IF(Y40=\"\",\"\",VLOOKUP(Y40,big_tabela,4,0))","v":"04. Kuchnia"},null,{"$f":"IF(Y40=\"\",\"\",\"anemostat\")","v":"anemostat"},{"$f":"IF(Y40=\"\",\"\",\"x\"&VLOOKUP(Y40,big_tabela,56,0))","v":"x2"},null,null,{"$f":"IF(AK40=\"\",\"\",VLOOKUP(AK40,big_tabela,4,0))","v":""},null,{"$f":"IF(AK40=\"\",\"\",\"anemostat\")","v":""},{"$f":"IF(AK40=\"\",\"\",\"x\"&VLOOKUP(AK40,big_tabela,55,0))","v":""},{"$nulls":17},"",null,"",null,"1",null,"1"]
[{"$nulls":3},"1",null,{"$f":"$X$27","v":"1"},null,"1",null,"1",{"$nulls":43},"",null,"",null,{"$f":"$AL$27","v":"1"},null,"1"]
[{"$nulls":3},"1",null,"1",null,"1",null,"1",{"$nulls":43},"",null,"",null,"1",null,"1"]
[{"$nulls":3},"1",null,"1",null,"1",null,"1",{"$nulls":14},{"$f":"IF(Obliczenia!E65=\"10\",\"\",Obliczenia!E65)","v":""},{"$nulls":11},{"$f":"IF(Obliczenia!E41=\"10\",\"\",Obliczenia!E41)","v":""},{"$nulls":16},"",null,"",null,"1",null,"1"]
[{"$nulls":3},"1",null,"1",null,"1",null,"1",{"$nulls":13},{"$f":"IF(Y47<>\"\",\"1\",\"\")","v":""},null,null,{"$f":"IF(Y47=\"\",\"\",VLOOKUP(Y47,big_tabela,3,0))","v":""},null,{"$f":"IF(Y47=\"\",\"\",VLOOKUP(Y47,big_tabela,12,0))","v":""},"m3/h",null,null,{"$f":"IF(AK47=\"\",\"\",VLOOKUP(AK47,big_tabela,3,0))","v":""},null,{"$f":"IF(AK47=\"\",\"\",VLOOKUP(AK47,big_tabela,12,0))","v":""},"m3/h",null,{"$f":"IF(AK47<>\"\",\"1\",\"\")","v":""},{"$nulls":15},"",null,"",null,"1",null,"1"]
[{"$nulls":3},"1",null,"1",null,"1",null,"1",{"$nulls":12},{"$f":"IF(Y47=\"\",\"\",\"Φ90\")","v":""},{"$f":"IF(Y47=\"\",\"\",\"x\"&VLOOKUP(Y47,big_tabela,53,0))","v":""},{"$f":"IF(Y47=\"\",\"\",\"◄\")","v":""},{"$nulls":11},{"$f":"IF(AK47=\"\",\"\",\"◄\")","v":""},{"$f":"IF(AK47=\"\",\"\",\"Φ90\")","v":""},{"$f":"IF(AK47=\"\",\"\",\"x\"&VLOOKUP(AK47,big_tabela,52,0))","v":""},{"$nulls":14},"",null,"",null,"1",null,"1"]
[{"$nulls":3},"1",null,"1",null,"1",null,"1",null,{"$f":"$X$48","v":""},"","","","","","","","","","","","",{"$f":"$X$48","v":""},{"$nulls":11},{"$f":"$AL$48","v":""},"","","","","","","","","","","","","","","",null,"",null,"",null,"1",null,"1"]
[{"$nulls":3},"1",null,"1",null,"1",null,"1",null,"",{"$nulls":14},{"$f":"IF(Y47=\"\",\"\",VLOOKUP(Y47,big_tabela,4,0))","v":""},null,{"$f":"IF(Y47=\"\",\"\",\"anemostat\")","v":""},{"$f":"IF(Y47=\"\",\"\",\"x\"&VLOOKUP(Y47,big_tabela,56,0))","v":""},null,null,{"$f":"IF(AK47=\"\",\"\",VLOOKUP(AK47,big_tabela,4,0))","v":""},null,{"$f":"IF(AK47=\"\",\"\",\"anemostat\")","v":""},{"$f":"IF(AK47=\"\",\"\",\"x\"&VLOOKUP(AK47,big_tabela,55,0))","v":""},{"$nulls":15},"",null,"",null,"",null,"1",null,"1"]
[{"$nulls":3},"1",null,"1",null,"1",null,"1",null,"",{"$nulls":39},"",null,"",null,{"$f":"$AL$34","v":""},null,"1",null,"1"]
[{"$nulls":3},"1",null,"1",null,"1",null,"1",null,"",{"$nulls":39},"",null,"",null,"",null,"1",null,"1"]
[{"$nulls":3},"1",null,"1",null,"1",null,"1",null,"",{"$nulls":12},{"$f":"IF(Obliczenia!E66=\"10\",\"\",Obliczenia!E66)","v":""},{"$nulls":11},{"$f":"IF(Obliczenia!E42=\"10\",\"\",Obliczenia!E42)","v":""},{"$nulls":14},"",null,"",null,"",null,"1",null,"1"]
[{"$nulls":3},"1",null,"1",null,"1",null,"1",null,"",{"$nulls":11},{"$f":"IF(Y54<>\"\",\"1\",\"\")","v":""},null,null,{"$f":"IF(Y54=\"\",\"\",VLOOKUP(Y54,big_tabela,3,0))","v":""},null,{"$f":"IF(Y54=\"\",\"\",VLOOKUP(Y54,big_tabela,12,0))","v":""},"m3/h",null,null,{"$f":"IF(AK54=\"\",\"\",VLOOKUP(AK54,big_tabela,3,0))","v":""},null,{"$f":"IF(AK54=\"\",\"\",VLOOKUP(AK54,big_tabela,12,0))","v":""},"m3/h",null,{"$f":"IF(AK54<>\"\",\"1\",\"\")","v":""},{"$nulls":13},"",null,"",null,"",null,"1",null,"1"]
[{"$nulls":3},"1",null,"1",null,"1",null,"1",null,"",{"$nulls":10},{"$f":"IF(Y54=\"\",\"\",\"Φ90\")","v":""},{"$f":"IF(Y54=\"\",\"\",\"x\"&VLOOKUP(Y54,big_tabela,53,0))","v":""},{"$f":"IF(Y54=\"\",\"\",\"◄\")","v":""},{"$nulls":11},{"$f":"IF(AK54=\"\",\"\",\"◄\")","v":""},{"$f":"IF(AK54=\"\",\"\",\"Φ90\")","v":""},{"$f":"IF(AK54=\"\",\"\",\"x\"&VLOOKUP(AK54,big_tabela,52,0))","v":""},{"$nulls":12},"",null,"",null,"",null,"1",null,"1"]
[{"$nulls":3},"1",null,"1",null,"1",null,"1",null,"",null,{"$f":"$X$55","v":""},"","","","","","","","","","",{"$f":"$X$55","v":""},{"$nulls":11},{"$f":"$AL$55","v":""},"","","","","","","","","","","","","",null,"",null,"",null,"",null,"1",null,"1"]
[{"$nulls":3},"1",null,"1",null,"1",null,"1",null,"",null,"",{"$nulls":12},{"$f":"IF(Y54=\"\",\"\",VLOOKUP(Y54,big_tabela,4,0))","v":""},null,{"$f":"IF(Y54=\"\",\"\",\"anemostat\")","v":""},{"$f":"IF(Y54=\"\",\"\",\"x\"&VLOOKUP(Y54,big_tabela,56,0))","v":""},null,null,{"$f":"IF(AK54=\"\",\"\",VLOOKUP(AK54,big_tabela,4,0))","v":""},null,{"$f":"IF(AK54=\"\",\"\",\"anemostat\")","v":""},{"$f":"IF(AK54=\"\",\"\",\"x\"&VLOOKUP(AK54,big_tabela,55,0))","v":""},{"$nulls":13},"",null,"",null,"",null,"",null,"1",null,"1"]
[{"$nulls":3},"1",null,"1",null,"1",null,{"$f":"$X$41","v":"1"},null,"",null,"",{"$nulls":35},"",null,"",null,{"$f":"$AL$41","v":""},null,"",null,"1",null,"1"]
[{"$nulls":3},"1",null,"1",null,"1",null,"1",null,"",null,"",{"$nulls":35},"",null,"",null,"",null,"",null,"1",null,"1"]
[{"$nulls":3},"1",null,"1",null,"1",null,"1",null,"",null,"",{"$nulls":10},{"$f":"IF(Obliczenia!E67=\"10\",\"\",Obliczenia!E67)","v":""},{"$nulls":11},{"$f":"IF(Obliczenia!E43=\"10\",\"\",Obliczenia!E43)","v":""},{"$nulls":12},"",null,"",null,"",null,"",null,"1",null,"1"]
[{"$nulls":3},"1",null,"1",null,"1",null,"1",null,"",null,"",{"$nulls":9},{"$f":"IF(Y61<>\"\",\"1\",\"\")","v":""},null,null,{"$f":"IF(Y61=\"\",\"\",VLOOKUP(Y61,big_tabela,3,0))","v":""},null,{"$f":"IF(Y61=\"\",\"\",VLOOKUP(Y61,big_tabela,12,0))","v":""},"m3/h",null,null,{"$f":"IF(AK61=\"\",\"\",VLOOKUP(AK61,big_tabela,3,0))","v":""},null,{"$f":"IF(AK61=\"\",\"\",VLOOKUP(AK61,big_tabela,12,0))","v":""},"m3/h",null,{"$f":"IF(AK61<>\"\",\"1\",\"\")","v":""},{"$nulls":11},"",null,"",null,"",null,"",null,"1",null,"1"]
[{"$nulls":3},"1",null,"1",null,"1",null,"1",null,"",null,"",{"$nulls":8},{"$f":"IF(Y61=\"\",\"\",\"Φ90\")","v":""},{"$f":"IF(Y61=\"\",\"\",\"x\"&VLOOKUP(Y61,big_tabela,53,0))","v":""},{"$f":"IF(Y61=\"\",\"\",\"◄\")","v":""},{"$nulls":11},{"$f":"IF(AK61=\"\",\"\",\"◄\")","v":""},{"$f":"IF(AK61=\"\",\"\",\"Φ90\")","v":""},{"$f":"IF(AK61=\"\",\"\",\"x\"&VLOOKUP(AK61,big_tabela,52,0))","v":""},{"$nulls":10},"",null,"",null,"",null,"",null,"1",null,"1"]
[{"$nulls":3},"1",null,"1",null,"1",null,"1",null,"",null,"",null,{"$f":"$X$62","v":""},{"$f":"$X$62","v":""},"","","","","","","","",{"$nulls":11},{"$f":"$AL$62","v":""},"","","","","","","","","","","",null,"",null,"",null,"",null,"",null,"1",null,"1"]
[{"$nulls":3},"1",null,"1",null,"1",null,"1",null,"",null,"",null,{"$f":"$X$62","v":""},{"$nulls":10},{"$f":"IF(Y61=\"\",\"\",VLOOKUP(Y61,big_tabela,4,0))","v":""},null,{"$f":"IF(Y61=\"\",\"\",\"anemostat\")","v":""},{"$f":"IF(Y61=\"\",\"\",\"x\"&VLOOKUP(Y61,big_tabela,56,0))","v":""},null,null,{"$f":"IF(AK61=\"\",\"\",VLOOKUP(AK61,big_tabela,4,0))","v":""},null,{"$f":"IF(AK61=\"\",\"\",\"anemostat\")","v":""},{"$f":"IF(AK61=\"\",\"\",\"x\"&VLOOKUP(AK61,big_tabela,55,0))","v":""},{"$nulls":11},"",null,"",null,"",null,"",null,"",null,"1",null,"1"]
[{"$nulls":3},"1",null,"1",null,"1",null,"1",null,"",null,"",null,"",{"$nulls":31},"",null,"",null,{"$f":"$AL$48","v":""},null,"",null,"",null,"1",null,"1"]
[{"$nulls":3},"1",null,"1",null,"1",null,"1",null,"",null,"",null,"",{"$nulls":31},"",null,"",null,"",null,"",null,"",null,"1",null,"1"]
[{"$nulls":3},"1",null,"1",null,"1",null,"1",null,"",null,"",null,"",{"$nulls":8},{"$f":"IF(Obliczenia!E68=\"10\",\"\",Obliczenia!E68)","v":""},{"$nulls":11},{"$f":"IF(Obliczenia!E44=\"10\",\"\",Obliczenia!E44)","v":""},{"$nulls":10},"",null,"",null,"",null,"",null,"",null,"1",null,"1"]
[{"$nulls":3},"1",null,"1",null,"1",null,"1",null,"",null,"",null,"",{"$nulls":7},{"$f":"IF(Y68<>\"\",\"1\",\"\")","v":""},null,null,{"$f":"IF(Y68=\"\",\"\",VLOOKUP(Y68,big_tabela,3,0))","v":""},null,{"$f":"IF(Y68=\"\",\"\",VLOOKUP(Y68,big_tabela,12,0))","v":""},"m3/h",null,null,{"$f":"IF(AK68=\"\",\"\",VLOOKUP(AK68,big_tabela,3,0))","v":""},null,{"$f":"IF(AK68=\"\",\"\",VLOOKUP(AK68,big_tabela,12,0))","v":""},"m3/h",null,{"$f":"IF(AK68<>\"\",\"1\",\"\")","v":""},{"$nulls":9},"",null,"",null,"",null,"",null,"",null,"1",null,"1"]
[{"$nulls":3},"1",null,"1",null,"1",null,"1",null,"",null,"",null,"",{"$nulls":6},{"$f":"IF(Y68=\"\",\"\",\"Φ90\")","v":""},{"$f":"IF(Y68=\"\",\"\",\"x\"&VLOOKUP(Y68,big_tabela,53,0))","v":""},{"$f":"IF(Y68=\"\",\"\",\"◄\")","v":""},{"$nulls":11},{"$f":"IF(AK68=\"\",\"\",\"◄\")","v":""},{"$f":"IF(AK68=\"\",\"\",\"Φ90\")","v":""},{"$f":"IF(AK68=\"\",\"\",\"x\"&VLOOKUP(AK68,big_tabela,52,0))","v":""},{"$nulls":8},"",null,"",null,"",null,"",null,"",null,"1",null,"1"]
[{"$nulls":3},"1",null,"1",null,"1",null,"1",null,"",null,"",null,"",null,{"$f":"$X$69","v":""},"","","","","","",{"$f":"$X$69","v":""},{"$nulls":11},{"$f":"$AL$69","v":""},"","","","","","","","","",null,"",null,"",null,"",null,"",null,"",null,"1",null,"1"]
[{"$nulls":3},"1",null,"1",null,"1",null,"1",null,"",null,"",null,"",null,"",{"$nulls":8},{"$f":"IF(Y68=\"\",\"\",VLOOKUP(Y68,big_tabela,4,0))","v":""},null,{"$f":"IF(Y68=\"\",\"\",\"anemostat\")","v":""},{"$f":"IF(Y68=\"\",\"\",\"x\"&VLOOKUP(Y68,big_tabela,56,0))","v":""},null,null,{"$f":"IF(AK68=\"\",\"\",VLOOKUP(AK68,big_tabela,4,0))","v":""},null,{"$f":"IF(AK68=\"\",\"\",\"anemostat\")","v":""},{"$f":"IF(AK68=\"\",\"\",\"x\"&VLOOKUP(AK68,big_tabela,55,0))","v":""},{"$nulls":9},"",null,"",null,"",null,"",null,"",null,"",null,"1",null,"1"]
[{"$nulls":3},"1",null,"1",null,"1",null,"1",null,"",null,"",null,"",null,"",{"$nulls":27},"",null,"",null,{"$f":"$AL$55","v":""},null,"",null,"",null,"",null,"1",null,"1"]
[{"$nulls":3},"1",null,"1",null,"1",null,"1",null,"",null,"",null,"",null,"",{"$nulls":27},"",null,"",null,"",null,"",null,"",null,"",null,"1",null,"1"]
[{"$nulls":3},"1",null,"1",null,"1",null,"1",null,"",null,"",null,"",null,"",{"$nulls":6},{"$f":"IF(Obliczenia!E69=\"10\",\"\",Obliczenia!E69)","v":""},{"$nulls":11},{"$f":"IF(Obliczenia!E45=\"10\",\"\",Obliczenia!E45)","v":""},{"$nulls":8},"",null,"",null,"",null,"",null,"",null,"",null,"1",null,"1"]
[{"$nulls":3},"1",null,"1",null,"1",null,"1",null,"",null,"",null,"",null,"",{"$nulls":5},{"$f":"IF(Y75<>\"\",\"1\",\"\")","v":""},null,null,{"$f":"IF(Y75=\"\",\"\",VLOOKUP(Y75,big_tabela,3,0))","v":""},null,{"$f":"IF(Y75=\"\",\"\",VLOOKUP(Y75,big_tabela,12,0))","v":""},"m3/h",null,null,{"$f":"IF(AK75=\"\",\"\",VLOOKUP(AK75,big_tabela,3,0))","v":""},null,{"$f":"IF(AK75=\"\",\"\",VLOOKUP(AK75,big_tabela,12,0))","v":""},"m3/h",null,{"$f":"IF(AK75<>\"\",\"1\",\"\")","v":""},{"$nulls":7},"",null,"",null,"",null,"",null,"",null,"",null,"1",null,"1"]
[{"$nulls":3},"1",null,"1",null,"1",null,"1",null,"",null,"",null,"",null,"",{"$nulls":4},{"$f":"IF(Y75=\"\",\"\",\"Φ90\")","v":""},{"$f":"IF(Y75=\"\",\"\",\"x\"&VLOOKUP(Y75,big_tabela,53,0))","v":""},{"$f":"IF(Y75=\"\",\"\",\"◄\")","v":""},{"$nulls":11},{"$f":"IF(AK75=\"\",\"\",\"◄\")","v":""},{"$f":"IF(AK75=\"\",\"\",\"Φ90\")","v":""},{"$f":"IF(AK75=\"\",\"\",\"x\"&VLOOKUP(AK75,big_tabela,52,0))","v":""},{"$nulls":6},"",null,"",null,"",null,"",null,"",null,"",null,"1",null,"1"]
[{"$nulls":3},"1",null,"1",null,"1",null,"1",null,"",null,"",null,"",null,"",null,{"$f":"$X$76","v":""},"","","","",{"$f":"$X$76","v":""},{"$nulls":11},{"$f":"$AL$76","v":""},{"$f":"$AL$76","v":""},"","","","","","",null,"",null,"",null,"",null,"",null,"",null,"",null,"1",null,"1"]
[{"$nulls":3},"1",null,"1",null,"1",null,"1",null,"",null,"",null,"",null,"",null,"",{"$nulls":6},{"$f":"IF(Y75=\"\",\"\",VLOOKUP(Y75,big_tabela,4,0))","v":""},null,{"$f":"IF(Y75=\"\",\"\",\"anemostat\")","v":""},{"$f":"IF(Y75=\"\",\"\",\"x\"&VLOOKUP(Y75,big_tabela,56,0))","v":""},null,null,{"$f":"IF(AK75=\"\",\"\",VLOOKUP(AK75,big_tabela,4,0))","v":""},null,{"$f":"IF(AK75=\"\",\"\",\"anemostat\")","v":""},{"$f":"IF(AK75=\"\",\"\",\"x\"&VLOOKUP(AK75,big_tabela,55,0))","v":""},{"$nulls":7},"",null,"",null,"",null,"",null,"",null,"",null,"",null,"1",null,"1"]
[{"$nulls":3},"1",null,"1",null,"1",null,"1",null,"",null,"",null,"",null,"",null,"",{"$nulls":23},"",null,"",null,{"$f":"$AL$62","v":""},null,"",null,"",null,"",null,"",null,"1",null,"1"]
[{"$nulls":3},"1",null,"1",null,"1",null,"1",null,"",null,"",null,"",null,"",null,"",{"$nulls":23},"",null,"",null,"",null,"",null,"",null,"",null,"",null,"1",null,"1"]
[{"$nulls":3},"1",null,"1",null,"1",null,"1",null,"",null,"",null,"",null,"",null,"",{"$nulls":4},{"$f":"IF(Obliczenia!E70=\"10\",\"\",Obliczenia!E70)","v":""},{"$nulls":11},{"$f":"IF(Obliczenia!E46=\"10\",\"\",Obliczenia!E46)","v":""},{"$nulls":6},"",null,"",null,"",null,"",null,"",null,"",null,"",null,"1",null,"1"]
[{"$nulls":3},"1",null,"1",null,"1",null,"1",null,"",null,"",null,"",null,"",null,"",{"$nulls":3},{"$f":"IF(Y82<>\"\",\"1\",\"\")","v":""},null,null,{"$f":"IF(Y82=\"\",\"\",VLOOKUP(Y82,big_tabela,3,0))","v":""},null,{"$f":"IF(Y82=\"\",\"\",VLOOKUP(Y82,big_tabela,12,0))","v":""},"m3/h",null,null,{"$f":"IF(AK82=\"\",\"\",VLOOKUP(AK82,big_tabela,3,0))","v":""},null,{"$f":"IF(AK82=\"\",\"\",VLOOKUP(AK82,big_tabela,12,0))","v":""},"m3/h",null,{"$f":"IF(AK82<>\"\",\"1\",\"\")","v":""},{"$nulls":5},"",null,"",null,"",null,"",null,"",null,"",null,"",null,"1",null,"1"]
[{"$nulls":3},"1",null,"1",null,"1",null,"1",null,"",null,"",null,"",null,"",null,"",null,null,{"$f":"IF(Y82=\"\",\"\",\"Φ90\")","v":""},{"$f":"IF(Y82=\"\",\"\",\"x\"&VLOOKUP(Y82,big_tabela,53,0))","v":""},{"$f":"IF(Y82=\"\",\"\",\"◄\")","v":""},{"$nulls":11},{"$f":"IF(AK82=\"\",\"\",\"◄\")","v":""},{"$f":"IF(AK82=\"\",\"\",\"Φ90\")","v":""},{"$f":"IF(AK82=\"\",\"\",\"x\"&VLOOKUP(AK82,big_tabela,52,0))","v":""},{"$nulls":4},"",null,"",null,"",null,"",null,"",null,"",null,"",null,"1",null,"1"]
[{"$nulls":3},"1",null,"1",null,"1",null,"1",null,"",null,"",null,"",null,"",null,"",null,{"$f":"$X$83","v":""},"","",{"$f":"$X$83","v":""},{"$nulls":11},{"$f":"$AL$83","v":""},"","","","","",null,"",null,"",null,"",null,"",null,"",null,"",null,"",null,"1",null,"1"]
[{"$nulls":3},"1",null,"1",null,"1",null,"1",null,"",null,"",null,"",null,"",null,"",null,"",{"$nulls":4},{"$f":"IF(Y82=\"\",\"\",VLOOKUP(Y82,big_tabela,4,0))","v":""},null,{"$f":"IF(Y82=\"\",\"\",\"anemostat\")","v":""},{"$f":"IF(Y82=\"\",\"\",\"x\"&VLOOKUP(Y82,big_tabela,56,0))","v":""},null,null,{"$f":"IF(AK82=\"\",\"\",VLOOKUP(AK82,big_tabela,4,0))","v":""},null,{"$f":"IF(AK82=\"\",\"\",\"anemostat\")","v":""},{"$f":"IF(AK82=\"\",\"\",\"x\"&VLOOKUP(AK82,big_tabela,55,0))","v":""},{"$nulls":5},{"$f":"$AL$83","v":""},null,"",null,"",null,"",null,"",null,"",null,"",null,"",null,"1",null,"1"]
[{"$nulls":3},{"$f":"$X$20","v":"1"},null,"1",null,"1",null,"1",null,"",null,"",null,"",null,"",null,"",null,"",{"$nulls":19},{"$f":"$AL$83","v":""},null,"",null,{"$f":"$AL$69","v":""},null,"",null,"",null,"",null,"",null,"",null,"1",null,"1"]
[{"$nulls":4},{"$f":"Obliczenia!BI31","v":"S 6x75"},{"$nulls":37},{"$f":"Obliczenia!BG31","v":"S 6x75"}]
[{"$nulls":4},{"$f":"IF(E90<>\"\",\"+\",\"\")","v":""},{"$nulls":17},{"$f":"\"  \"&Obliczenia!BB30&\"x kanał DN90\"","v":"  6x kanał DN90"},{"$nulls":15},{"$f":"Obliczenia!BA30&\"x kanał DN90\"","v":"5x kanał DN90"},{"$nulls":3},{"$f":"IF(AQ90<>\"\",\"+\",\"\")","v":""}]
[{"$nulls":4},{"$f":"Obliczenia!BI34","v":""},{"$nulls":37},{"$f":"Obliczenia!BG34","v":""}]
[{"$nulls":15},{"$f":"$X$113","v":""},null,{"$f":"$X$106","v":""},null,{"$f":"$X$99","v":""},null,{"$f":"$X$92","v":""},null,null,{"$f":"IF(Obliczenia!E71=\"10\",\"\",Obliczenia!E71)","v":""},{"$nulls":11},{"$f":"IF(Obliczenia!E47=\"10\",\"\",Obliczenia!E47)","v":""},{"$nulls":4},{"$f":"$AL$92","v":""},null,{"$f":"$AL$99","v":""},null,{"$f":"$AL$106","v":""},null,{"$f":"$AL$113","v":""}]
[{"$nulls":15},"",null,"",null,"",null,"",null,{"$f":"IF(Y91<>\"\",\"1\",\"\")","v":""},null,null,{"$f":"IF(Y91=\"\",\"\",VLOOKUP(Y91,big_tabela,3,0))","v":""},null,{"$f":"IF(Y91=\"\",\"\",VLOOKUP(Y91,big_tabela,12,0))","v":""},"m3/h",null,null,{"$f":"IF(AK91=\"\",\"\",VLOOKUP(AK91,big_tabela,3,0))","v":""},null,{"$f":"IF(AK91=\"\",\"\",VLOOKUP(AK91,big_tabela,12,0))","v":""},"m3/h",null,{"$f":"IF(AK91<>\"\",\"1\",\"\")","v":""},{"$nulls":3},"",null,"",null,"",null,""]
[{"$nulls":15},"",null,"",null,"",null,"",{"$f":"IF(Y91=\"\",\"\",\"Φ90\")","v":""},{"$f":"IF(Y91=\"\",\"\",\"x\"&VLOOKUP(Y91,big_tabela,53,0))","v":""},{"$f":"IF(Y91=\"\",\"\",\"◄\")","v":""},{"$nulls":11},{"$f":"IF(AK91=\"\",\"\",\"◄\")","v":""},{"$f":"IF(AK91=\"\",\"\",\"Φ90\")","v":""},{"$f":"IF(AK91=\"\",\"\",\"x\"&VLOOKUP(AK91,big_tabela,52,0))","v":""},null,null,"",null,"",null,"",null,""]
[{"$nulls":15},"",null,"",null,"",null,"","","",{"$f":"$X$92","v":""},{"$nulls":11},{"$f":"$AL$92","v":""},{"$f":"$AL$92","v":""},{"$f":"$AL$92","v":""},{"$f":"$AL$92","v":""},{"$f":"$AL$92","v":""},"",null,"",null,"",null,""]
[{"$nulls":15},"",null,"",null,"",{"$nulls":6},{"$f":"IF(Y91=\"\",\"\",VLOOKUP(Y91,big_tabela,4,0))","v":""},null,{"$f":"IF(Y91=\"\",\"\",\"anemostat\")","v":""},{"$f":"IF(Y91=\"\",\"\",\"x\"&VLOOKUP(Y91,big_tabela,56,0))","v":""},null,null,{"$f":"IF(AK91=\"\",\"\",VLOOKUP(AK91,big_tabela,4,0))","v":""},null,{"$f":"IF(AK91=\"\",\"\",\"anemostat\")","v":""},{"$f":"IF(AK91=\"\",\"\",\"x\"&VLOOKUP(AK91,big_tabela,55,0))","v":""},{"$nulls":7},"",null,"",null,""]
[{"$nulls":15},"",null,"",null,"",{"$nulls":23},"",null,"",null,""]
[{"$nulls":15},"",null,"",null,"",{"$nulls":23},"",null,"",null,""]
[{"$nulls":15},"",null,"",null,"",{"$nulls":4},{"$f":"IF(Obliczenia!E72=\"10\",\"\",Obliczenia!E72)","v":""},{"$nulls":11},{"$f":"IF(Obliczenia!E48=\"10\",\"\",Obliczenia!E48)","v":""},{"$nulls":6},"",null,"",null,""]
[{"$nulls":15},"",null,"",null,"",{"$nulls":3},{"$f":"IF(Y98<>\"\",\"1\",\"\")","v":""},null,null,{"$f":"IF(Y98=\"\",\"\",VLOOKUP(Y98,big_tabela,3,0))","v":""},null,{"$f":"IF(Y98=\"\",\"\",VLOOKUP(Y98,big_tabela,12,0))","v":""},"m3/h",null,null,{"$f":"IF(AK98=\"\",\"\",VLOOKUP(AK98,big_tabela,3,0))","v":""},null,{"$f":"IF(AK98=\"\",\"\",VLOOKUP(AK98,big_tabela,12,0))","v":""},"m3/h",null,{"$f":"IF(AK98<>\"\",\"1\",\"\")","v":""},{"$nulls":5},"",null,"",null,""]
[{"$nulls":15},"",null,"",null,"",null,null,{"$f":"IF(Y98=\"\",\"\",\"Φ90\")","v":""},{"$f":"IF(Y98=\"\",\"\",\"x\"&VLOOKUP(Y98,big_tabela,53,0))","v":""},{"$f":"IF(Y98=\"\",\"\",\"◄\")","v":""},{"$nulls":11},{"$f":"IF(AK98=\"\",\"\",\"◄\")","v":""},{"$f":"IF(AK98=\"\",\"\",\"Φ90\")","v":""},{"$f":"IF(AK98=\"\",\"\",\"x\"&VLOOKUP(AK98,big_tabela,52,0))","v":""},{"$nulls":4},"",null,"",null,""]
[{"$nulls":15},"",null,"",null,"","","","","",{"$f":"$X$99","v":""},{"$nulls":11},{"$f":"$AL$99","v":""},"","","","","","","",null,"",null,""]
[{"$nulls":15},"",null,"",{"$nulls":8},{"$f":"IF(Y98=\"\",\"\",VLOOKUP(Y98,big_tabela,4,0))","v":""},null,{"$f":"IF(Y98=\"\",\"\",\"anemostat\")","v":""},{"$f":"IF(Y98=\"\",\"\",\"x\"&VLOOKUP(Y98,big_tabela,56,0))","v":""},null,null,{"$f":"IF(AK98=\"\",\"\",VLOOKUP(AK98,big_tabela,4,0))","v":""},null,{"$f":"IF(AK98=\"\",\"\",\"anemostat\")","v":""},{"$f":"IF(AK98=\"\",\"\",\"x\"&VLOOKUP(AK98,big_tabela,55,0))","v":""},{"$nulls":9},"",null,""]
[{"$nulls":15},"",null,"",{"$nulls":27},"",null,""]
[{"$nulls":15},"",null,"",{"$nulls":27},"",null,""]
[{"$nulls":15},"",null,"",{"$nulls":6},{"$f":"IF(Obliczenia!E73=\"10\",\"\",Obliczenia!E73)","v":""},{"$nulls":11},{"$f":"IF(Obliczenia!E49=\"10\",\"\",Obliczenia!E49)","v":""},{"$nulls":8},"",null,""]
[{"$nulls":15},"",null,"",{"$nulls":5},{"$f":"IF(Y105<>\"\",\"1\",\"\")","v":""},null,null,{"$f":"IF(Y105=\"\",\"\",VLOOKUP(Y105,big_tabela,3,0))","v":""},null,{"$f":"IF(Y105=\"\",\"\",VLOOKUP(Y105,big_tabela,12,0))","v":""},"m3/h",null,null,{"$f":"IF(AK105=\"\",\"\",VLOOKUP(AK105,big_tabela,3,0))","v":""},null,{"$f":"IF(AK105=\"\",\"\",VLOOKUP(AK105,big_tabela,12,0))","v":""},"m3/h",null,{"$f":"IF(AK105<>\"\",\"1\",\"\")","v":""},{"$nulls":7},"",null,""]
[{"$nulls":15},"",null,"",{"$nulls":4},{"$f":"IF(Y105=\"\",\"\",\"Φ90\")","v":""},{"$f":"IF(Y105=\"\",\"\",\"x\"&VLOOKUP(Y105,big_tabela,53,0))","v":""},{"$f":"IF(Y105=\"\",\"\",\"◄\")","v":""},{"$nulls":11},{"$f":"IF(AK105=\"\",\"\",\"◄\")","v":""},{"$f":"IF(AK105=\"\",\"\",\"Φ90\")","v":""},{"$f":"IF(AK105=\"\",\"\",\"x\"&VLOOKUP(AK105,big_tabela,52,0))","v":""},{"$nulls":6},"",null,""]
[{"$nulls":15},"",null,"","","","","","","",{"$f":"$X$106","v":""},{"$nulls":11},{"$f":"$AL$106","v":""},"","","","","","","","","",null,""]
[{"$nulls":15},"",{"$nulls":10},{"$f":"IF(Y105=\"\",\"\",VLOOKUP(Y105,big_tabela,4,0))","v":""},null,{"$f":"IF(Y105=\"\",\"\",\"anemostat\")","v":""},{"$f":"IF(Y105=\"\",\"\",\"x\"&VLOOKUP(Y105,big_tabela,56,0))","v":""},null,null,{"$f":"IF(AK105=\"\",\"\",VLOOKUP(AK105,big_tabela,4,0))","v":""},null,{"$f":"IF(AK105=\"\",\"\",\"anemostat\")","v":""},{"$f":"IF(AK105=\"\",\"\",\"x\"&VLOOKUP(AK105,big_tabela,55,0))","v":""},{"$nulls":11},""]
[{"$nulls":15},"",{"$nulls":31},""]
[{"$nulls":15},"",{"$nulls":31},""]
[{"$nulls":15},"",{"$nulls":8},{"$f":"IF(Obliczenia!E74=\"10\",\"\",Obliczenia!E74)","v":""},{"$nulls":11},{"$f":"IF(Obliczenia!E50=\"10\",\"\",Obliczenia!E50)","v":""},{"$nulls":10},""]
[{"$nulls":15},"",{"$nulls":7},{"$f":"IF(Y112<>\"\",\"1\",\"\")","v":""},null,null,{"$f":"IF(Y112=\"\",\"\",VLOOKUP(Y112,big_tabela,3,0))","v":""},null,{"$f":"IF(Y112=\"\",\"\",VLOOKUP(Y112,big_tabela,12,0))","v":""},"m3/h",null,null,{"$f":"IF(AK112=\"\",\"\",VLOOKUP(AK112,big_tabela,3,0))","v":""},null,{"$f":"IF(AK112=\"\",\"\",VLOOKUP(AK112,big_tabela,12,0))","v":""},"m3/h",null,{"$f":"IF(AK112<>\"\",\"1\",\"\")","v":""},{"$nulls":9},""]
[{"$nulls":15},"",{"$nulls":6},{"$f":"IF(Y112=\"\",\"\",\"Φ90\")","v":""},{"$f":"IF(Y112=\"\",\"\",\"x\"&VLOOKUP(Y112,big_tabela,53,0))","v":""},{"$f":"IF(Y112=\"\",\"\",\"◄\")","v":""},{"$nulls":11},{"$f":"IF(AK112=\"\",\"\",\"◄\")","v":""},{"$f":"IF(AK112=\"\",\"\",\"Φ90\")","v":""},{"$f":"IF(AK112=\"\",\"\",\"x\"&VLOOKUP(AK112,big_tabela,52,0))","v":""},{"$nulls":8},""]
[{"$nulls":15},"","","","","","","","","",{"$f":"$X$113","v":""},{"$nulls":11},{"$f":"$AL$113","v":""},"","","","","","","","","","",""]
[{"$nulls":26},{"$f":"IF(Y112=\"\",\"\",VLOOKUP(Y112,big_tabela,4,0))","v":""},null,{"$f":"IF(Y112=\"\",\"\",\"anemostat\")","v":""},{"$f":"IF(Y112=\"\",\"\",\"x\"&VLOOKUP(Y112,big_tabela,56,0))","v":""},null,null,{"$f":"IF(AK112=\"\",\"\",VLOOKUP(AK112,big_tabela,4,0))","v":""},null,{"$f":"IF(AK112=\"\",\"\",\"anemostat\")","v":""},{"$f":"IF(AK112=\"\",\"\",\"x\"&VLOOKUP(AK112,big_tabela,55,0))","v":""}]
[]
[]
[{"$nulls":28},{"$f":"X137","v":"Vitovent 300-W 400m3/h lewa"}]
[]
[]
[{"$nulls":23},{"$f":"\"Kanał zbiorczy 200/174, króciec przyłączeniowy Φ \"&Obliczenia!AN59","v":"Kanał zbiorczy 200/174, króciec przyłączeniowy Φ 180"},{"$nulls":9},{"$f":"\"            Kanał zbiorczy 200/174, króciec przyłączeniowy Φ \"&Obliczenia!AN59","v":"            Kanał zbiorczy 200/174, króciec przyłączeniowy Φ 180"}]
[]
[]
[{"$nulls":23},{"$f":"\"Kanał zbiorczy 200/174, króciec przyłączeniowy Φ \"&Obliczenia!AN59","v":"Kanał zbiorczy 200/174, króciec przyłączeniowy Φ 180"},{"$nulls":9},{"$f":"\"            Kanał zbiorczy 200/174, króciec przyłączeniowy Φ \"&Obliczenia!AN59","v":"            Kanał zbiorczy 200/174, króciec przyłączeniowy Φ 180"}]
[]
[]
[null,null,"Szacunkowy dobór centrali wentylacyjnej i systemu dystrybucji powietrza"]
[]
[]
[]
[]
[{"$nulls":22},"Centrala wentylacyjna"]
[]
[]
[]
[{"$nulls":10},{"$f":"Obliczenia!AK84","v":""},{"$nulls":12},"Vitovent 300-W 400m3/h lewa",{"$nulls":4},{"$f":"\"R \"&AC138&\" %\"","v":"R 5 %"},{"$f":"VLOOKUP(X137,rozdzial,4,0)-VLOOKUP(X137,rozdzial,4,0)*(AC138/100)","v":{"v":12430.75,"d":"12,430.75 zł"}},null,null,"Sprawność temperaturowa ErP",{"$nulls":4},{"$f":"VLOOKUP($X$137,Obliczenia!J37:W45,8,0)","v":92},"[%]"]
[{"$nulls":23},{"$f":"IF(X137=\"Vitoair FS 300E MA 300m3/h\",\"Centrala wentylacji mechanicznej z odzyskiem ciepła i wilgoci\",\"Centrala wentylacji mechanicznej z odzyskiem ciepła\")","v":"Centrala wentylacji mechanicznej z odzyskiem ciepła"},{"$nulls":4},5,{"$nulls":3},"Stopień zmiany wilgotności",{"$nulls":4},{"$f":"VLOOKUP($X$137,Obliczenia!J37:W45,9,0)","v":"n.d."},"[%]"]
[{"$nulls":23},{"$f":"VLOOKUP(X137,rozdzial,3,0)","v":"Z019043"},{"$nulls":8},"Rodzaj wymiennika ciepła",{"$nulls":4},{"$f":"VLOOKUP($X$137,Obliczenia!J37:W45,11,0)","v":"Krzyżowy"}]
[{"$nulls":32},"Klapa bypass",{"$nulls":4},{"$f":"VLOOKUP($X$137,Obliczenia!J37:W45,13,0)","v":"Tak"}]
[{"$nulls":23},{"$f":"\"    \"&VLOOKUP($X$137,Obliczenia!J37:W45,6,0)","v":"    50"},{"$f":"VLOOKUP($X$137,Obliczenia!J37:W45,4,0)&\" [m3/h]\"","v":"400 [m3/h]"},null,null,{"$f":"VLOOKUP($X$137,Obliczenia!J37:AA45,16,0)","v":"A"},{"$nulls":4},"Nagrzewnica powietrza zewnęrznego",{"$nulls":4},{"$f":"VLOOKUP($X$137,Obliczenia!J37:W45,14,0)","v":"Tak, 1kW"}]
[{"$nulls":27},{"$f":"VLOOKUP($X$137,Obliczenia!J37:AA45,17,0)","v":"A+"},{"$nulls":4},"Odpływ kondensatu",{"$nulls":4},{"$f":"VLOOKUP($X$137,Obliczenia!J37:W45,12,0)","v":"Tak"}]
[{"$nulls":27},{"$f":"VLOOKUP($X$137,Obliczenia!J37:AA45,18,0)","v":"A+"},{"$nulls":4},"Wymiary zewnętrzne D x W x S",{"$nulls":4},{"$f":"VLOOKUP($X$137,Obliczenia!J37:W45,10,0)","v":"560 x 695 x 750"},"[mm]"]
[]
[{"$nulls":23},{"$f":"IF(X137=\"Vitoair FS 300E MA 300m3/h\",\"Nagrzewnica elektryczna powietrza 1,8kW\",\"\")","v":""},{"$nulls":5},{"$f":"IFERROR(VLOOKUP(X145,rozdzial,4,0)-VLOOKUP(X145,rozdzial,4,0)*(AC138/100),\"\")","v":""}]
[{"$nulls":23},{"$f":"IF(X137=\"Vitoair FS 300E MA 300m3/h\",\"Do ogrzewania wstępnego powietrza, montaż wewn. centrali\",\"\")","v":""}]
[{"$nulls":23},{"$f":"IFERROR(VLOOKUP(X145,rozdzial,3,0),\"\")","v":""}]
[]
[{"$nulls":22},"Sterowanie"]
[]
[]
[]
[{"$nulls":32},"Vitotrol 300-E"]
[{"$nulls":10},{"$f":"Obliczenia!AK82","v":""},{"$nulls":12},"Moduł obsługowy ścienny LB1",{"$nulls":5},{"$f":"IF(X154=\"Sterowanie przez aplikację ViCare\",\"0 zł\",VLOOKUP(X154,rozdzial,4,0)-VLOOKUP(X154,rozdzial,4,0)*(AC138/100))","v":{"v":1506.7,"d":"1,506.70 zł"}},{"$nulls":4},"Radio"]
[{"$nulls":23},"do obsługi zdalnej centrali wentylacyjnej",{"$nulls":8},"Przełącznik\n4-pozycyjny",null,null,"Can-Bus"]
[{"$nulls":23},{"$f":"IF(X154=\"Sterowanie przez aplikację ViCare\",\"\",VLOOKUP(X154,rozdzial,3,0))","v":"Z015318"},{"$nulls":10},"Can-Bus",{"$nulls":4},"ViCare"]
[{"$nulls":34},"Vitoair FS 300E MA",null,"opcja Vitocal x5x-A"]
[{"$nulls":23},"",{"$nulls":5},{"$f":"IFERROR(VLOOKUP(X158,rozdzial,4,0)-VLOOKUP(X158,rozdzial,4,0)*(AC138/100),\"\")","v":""},null,null,"Stand Alone",null,null,"  Z pompą ciepła Vitocal z WO1C"]
[{"$nulls":23},{"$f":"IF(X137=\"Vitoair FS 300E MA 300m3/h\",\"Opcja: do komunikacji z pompą ciepłą z regulatorem E3\",IF(X158=\"Przewód komunikacyjny Can-Bus 5m\",\"Uwaga! Nie ma zastosowanie w tym rozwiązaniu\",\"\"))","v":""},{"$nulls":8},"bez ViCare App"]
[{"$nulls":23},{"$f":"IFERROR(VLOOKUP(X158,rozdzial,3,0),\"\")","v":""}]
[{"$nulls":32},"Moduł LB1",null,null,"Mod-Bus"]
[{"$nulls":22},"System dystrybucji  //  po stronie pomieszczeń",{"$nulls":16},"ViCare"]
[{"$nulls":34},"       Vitovent 300-W",null,"Vitotronic WO1C"]
[]
[]
[]
[{"$nulls":23},"Skrzynka rozprężna DN125 dla 1 kanału DN90",{"$nulls":4},{"$f":"Obliczenia!BC30","v":11},{"$f":"VLOOKUP(X167,rozdzial75,4,0)*AC167*(1-$AM$236/100)","v":{"v":1734.6999999999998,"d":"1,734.70 zł"}},{"$nulls":3},{"$f":"'Elementy DN75&90'!D43","v":"Kanał elastyczny okrągły DN90, 50 m"},{"$nulls":3},{"$f":"AK170","v":3},{"$f":"VLOOKUP(AH167,rozdzial75,4,0)*AL167*(1-$AM$236/100)","v":{"v":3719.25,"d":"3,719.25 zł"}}]
[{"$nulls":23},"Skrzynka rozprężna do mocowania anemostatu",{"$nulls":9},{"$f":"'Elementy DN75&90'!H41","v":"Krąg o długości 50 m, nadrukowane znaczniki długości, powierzchnia antybakteryjna i antystatyczna"}]
[{"$nulls":23},{"$f":"VLOOKUP(X167,rozdzial75,3,0)","v":7377343},{"$f":"VLOOKUP(X167,rozdzial75,4,0)","v":{"v":166,"d":"166.00 zł"}}]
[{"$nulls":33},{"$f":"VLOOKUP(AH167,rozdzial75,3,0)","v":"Z023111"},{"$f":"VLOOKUP(AH167,rozdzial75,4,0)","v":{"v":1305,"d":"1,305.00 zł"}},null,{"$f":"ROUNDUP(AC167*10/50,0)","v":3}]
[]
[{"$nulls":23},{"$f":"'Elementy DN75&90'!D56","v":"Anemostat wywiewny, biały"},{"$nulls":4},{"$f":"Obliczenia!BE30","v":6},{"$f":"VLOOKUP(X172,rozdzial75,4,0)*AC172*(1-$AM$236/100)","v":{"v":541.5,"d":"541.50 zł"}},{"$nulls":3},{"$f":"'Elementy DN75&90'!D55","v":"Anemostat nawiewny, biały"},{"$nulls":3},{"$f":"Obliczenia!BD30","v":5},{"$f":"VLOOKUP(AH172,rozdzial75,4,0)*AL172*(1-$AM$236/100)","v":{"v":508.25,"d":"508.25 zł"}}]
[{"$nulls":23},"Do wywiewania powietrza z pomieszczenia",{"$nulls":9},"Do nawiewania powietrza świeżego do pomieszczenia"]
[{"$nulls":23},{"$f":"VLOOKUP(X172,rozdzial75,3,0)","v":"ZK04571"},{"$f":"VLOOKUP(X172,rozdzial75,4,0)","v":{"v":95,"d":"95.00 zł"}},{"$nulls":8},{"$f":"VLOOKUP(AH172,rozdzial75,3,0)","v":"ZK04570"},{"$f":"VLOOKUP(AH172,rozdzial75,4,0)","v":{"v":107,"d":"107.00 zł"}}]
[]
[]
[{"$nulls":23},{"$f":"Obliczenia!BH31","v":"Skrzynka rozdzielacza S"},{"$nulls":4},{"$f":"Obliczenia!BI33","v":1},{"$f":"VLOOKUP(X177,'Elementy DN75&90'!D3:H57,4,0)*AC177*(1-$AM$236/100)+AC177*AB180","v":{"v":1126.9,"d":"1,126.90 zł"}},null,null,{"$f":"IF(AL177>0,\"+\",\"\")","v":""},{"$f":"Obliczenia!BH34","v":""},{"$nulls":3},{"$f":"Obliczenia!BI36","v":0},{"$f":"IF(AH177=\"\",0,VLOOKUP(AH177,'Elementy DN75&90'!D3:H55,4,0)*AL177*(1-$AM$236/100)+AL177*AK180)","v":{"v":0,"d":"0.00 zł"}}]
[{"$nulls":23},{"$f":"VLOOKUP(X177,rozdzial75,5,0)","v":"Zintegrowany tłumik hałasów, montaż płyty przyłączeniowej z przodu lub od góry, 360 x 238 x 249"},{"$nulls":9},{"$f":"IF(AH177=\"\",\"\",VLOOKUP(AH177,rozdzial75,5,0))","v":""}]
[]
[{"$nulls":23},{"$f":"VLOOKUP(X177,rozdzial75,3,0)","v":7377372},{"$f":"VLOOKUP(X177,rozdzial75,4,0)","v":{"v":1062,"d":"1,062.00 zł"}},null,{"$f":"IF(Obliczenia!Y59=125,'Elementy DN75&90'!F37,IF(Obliczenia!Y59=160,'Elementy DN75&90'!F38,'Elementy DN75&90'!F39))","v":"ZK01867"},{"$f":"VLOOKUP(AA180,'Elementy DN75&90'!F3:G57,2,0)","v":{"v":118,"d":"118.00 zł"}},{"$nulls":5},{"$f":"IF(AH177=\"\",\"\",VLOOKUP(AH177,rozdzial75,3,0))","v":""},{"$f":"IF(AH177=\"\",\"\",VLOOKUP(AH177,rozdzial75,4,0))","v":""},{"$f":"IF(AH177=\"\",\"\",IF(Obliczenia!Y59=125,'Elementy DN75&90'!F37,IF(Obliczenia!Y59=160,'Elementy DN75&90'!F38,'Elementy DN75&90'!F39)))","v":""},{"$f":"IF(AH177=\"\",\"\",VLOOKUP(AJ180,'Elementy DN75&90'!F3:G57,2,0))","v":""}]
[]
[{"$nulls":23},{"$f":"Obliczenia!BH32","v":"Płyta przyłączeniowa S 6 kanały DN75"},{"$nulls":4},{"$f":"AC177","v":1},{"$f":"VLOOKUP(X182,'Elementy DN75&90'!D3:H57,4,0)*AC182*(1-$AM$236/100)","v":{"v":656.4499999999999,"d":"656.45 zł"}},null,null,{"$f":"IF(AL182>0,\"+\",\"\")","v":""},{"$f":"Obliczenia!BH35","v":""},{"$nulls":3},{"$f":"AL177","v":0},{"$f":"IF(AH182=\"\",0,VLOOKUP(AH182,'Elementy DN75&90'!D8:H60,4,0)*AL182*(1-$AM$236/100)+AL182*AK185)","v":{"v":0,"d":"0.00 zł"}}]
[{"$nulls":23},{"$f":"VLOOKUP(X182,rozdzial75,5,0)","v":"Do montażu w module skrzynki rozdzielaczowej typu S, w zakresie dostawy 1 korek zaślepiający"},{"$nulls":9},{"$f":"IF(AH182=\"\",\"\",VLOOKUP(AH182,rozdzial75,5,0))","v":""}]
[]
[{"$nulls":23},{"$f":"VLOOKUP(X182,rozdzial75,3,0)","v":7377373},{"$f":"VLOOKUP(X182,rozdzial75,4,0)","v":{"v":691,"d":"691.00 zł"}},{"$nulls":8},{"$f":"IF(AH182=\"\",\"\",VLOOKUP(AH182,rozdzial75,3,0))","v":""},{"$f":"IF(AH182=\"\",\"\",VLOOKUP(AH182,rozdzial75,4,0))","v":""}]
[]
[{"$nulls":23},{"$f":"Obliczenia!BF31","v":"Skrzynka rozdzielacza S"},{"$nulls":4},{"$f":"Obliczenia!BG33","v":1},{"$f":"VLOOKUP(X187,'Elementy DN75&90'!D13:H67,4,0)*AC187*(1-$AM$236/100)+AC187*AB190","v":{"v":1126.9,"d":"1,126.90 zł"}},null,null,{"$f":"IF(AL187>0,\"+\",\"\")","v":""},{"$f":"Obliczenia!BF34","v":""},{"$nulls":3},{"$f":"Obliczenia!BG36","v":0},{"$f":"IF(AH187=\"\",0,VLOOKUP(AH187,'Elementy DN75&90'!D13:H65,4,0)*AL187*(1-$AM$236/100)+AL187*AK190)","v":{"v":0,"d":"0.00 zł"}}]
[{"$nulls":23},"Do montażu w module skrzynki rozdzielaczowej typu XL, w zakresie dostawy 1 korek zaślepiający",{"$nulls":9},{"$f":"IF(AH187=\"\",\"\",VLOOKUP(AH187,rozdzial75,5,0))","v":""}]
[]
[{"$nulls":23},{"$f":"VLOOKUP(X187,rozdzial75,3,0)","v":7377372},{"$f":"VLOOKUP(X187,rozdzial75,4,0)","v":{"v":1062,"d":"1,062.00 zł"}},null,{"$f":"IF(Obliczenia!Y59=125,'Elementy DN75&90'!F37,IF(Obliczenia!Y59=160,'Elementy DN75&90'!F38,'Elementy DN75&90'!F39))","v":"ZK01867"},{"$f":"VLOOKUP(AA190,'Elementy DN75&90'!F13:G67,2,0)","v":{"v":118,"d":"118.00 zł"}},{"$nulls":5},{"$f":"IF(AH187=\"\",\"\",VLOOKUP(AH187,rozdzial75,3,0))","v":""},{"$f":"IF(AH187=\"\",\"\",VLOOKUP(AH187,rozdzial75,4,0))","v":""},{"$f":"IF(AH187=\"\",\"\",IF(Obliczenia!Y69=125,'Elementy DN75&90'!F47,IF(Obliczenia!Y69=160,'Elementy DN75&90'!F48,'Elementy DN75&90'!F49)))","v":""},{"$f":"IF(AH187=\"\",\"\",VLOOKUP(AJ190,'Elementy DN75&90'!F13:G67,2,0))","v":""}]
[]
[{"$nulls":23},{"$f":"Obliczenia!BF32","v":"Płyta przyłączeniowa S 6 kanały DN75"},{"$nulls":4},{"$f":"AC187","v":1},{"$f":"VLOOKUP(X192,'Elementy DN75&90'!D13:H67,4,0)*AC192*(1-$AM$236/100)","v":{"v":656.4499999999999,"d":"656.45 zł"}},null,null,{"$f":"IF(AL192>0,\"+\",\"\")","v":""},{"$f":"Obliczenia!BF35","v":""},{"$nulls":3},{"$f":"AL187","v":0},{"$f":"IF(AH192=\"\",0,VLOOKUP(AH192,'Elementy DN75&90'!D18:H70,4,0)*AL192*(1-$AM$236/100)+AL192*AK195)","v":{"v":0,"d":"0.00 zł"}}]
[{"$nulls":23},"Do montażu w module skrzynki rozdzielaczowej typu XL, w zakresie dostawy 1 korek zaślepiający",{"$nulls":9},{"$f":"IF(AH192=\"\",\"\",VLOOKUP(AH192,rozdzial75,5,0))","v":""}]
[]
[{"$nulls":23},{"$f":"VLOOKUP(X192,rozdzial75,3,0)","v":7377373},{"$f":"VLOOKUP(X192,rozdzial75,4,0)","v":{"v":691,"d":"691.00 zł"}},{"$nulls":8},{"$f":"IF(AH192=\"\",\"\",VLOOKUP(AH192,rozdzial75,3,0))","v":""},{"$f":"IF(AH192=\"\",\"\",VLOOKUP(AH192,rozdzial75,4,0))","v":""}]
[]
[{"$nulls":22},"System dystrybucji  //  po stronie zewnętrznej"]
[]
[]
[]
[{"$nulls":23},"Kanał izolowany 200/174",{"$nulls":4},{"$f":"AB203","v":4},{"$f":"VLOOKUP(X201,rozdzial,4,0)*AC201*(1-$AM$236/100)","v":{"v":1504.8,"d":"1,504.80 zł"}},{"$nulls":3},"Kolano izolowane z mufą 90 stopni",{"$nulls":3},{"$f":"AK203","v":4},{"$f":"VLOOKUP(AH201,rozdzial,4,0)*AL201*(1-$AM$236/100)","v":{"v":680.1999999999999,"d":"680.20 zł"}}]
[{"$nulls":23},"1 sztuka = 2 m długości, przepływ maksymalny 400 m3/h",{"$nulls":9},"Do zmiany kierunku kanałów izolowanych 200/174"]
[{"$nulls":23},{"$f":"VLOOKUP(X201,rozdzial,3,0)","v":7546070},{"$f":"VLOOKUP(X201,rozdzial,4,0)","v":{"v":396,"d":"396.00 zł"}},null,null,4,{"$nulls":5},{"$f":"VLOOKUP(AH201,rozdzial,3,0)","v":7546071},{"$f":"VLOOKUP(AH201,rozdzial,4,0)","v":{"v":179,"d":"179.00 zł"}},null,4]
[]
[]
[{"$nulls":23},"Czerpnia/wyrzutnia ścienna z rurą",{"$nulls":4},2,{"$f":"VLOOKUP(X206,rozdzial,4,0)*AC206*(1-$AM$236/100)","v":{"v":568.1,"d":"568.10 zł"}},{"$nulls":3},{"$f":"IF(Obliczenia!Y57=\"Vitovent 300-W 325m3/h lewa\",\"Mufa/redukcja 200/150\",IF(Obliczenia!Y57=\"Vitovent 300-W 325m3/h prawa\",\"Mufa/redukcja 200/150\",IF(Obliczenia!Y57=\"Vitovent 300-W 400m3/h lewa\",\"Mufa/redukcja 200/180\",IF(Obliczenia!Y57=\"Vitovent 300-W 400m3/h prawa\",\"Mufa/redukcja 200/180\",IF(Obliczenia!Y57=\"Vitovent 300-W 225m3/h lewa\",\"Mufa/redukcja 200/125\",IF(Obliczenia!Y57=\"Vitovent 300-W 225m3/h prawa\",\"Mufa/redukcja 200/125\",\"Mufa/redukcja 200/150\"))))))","v":"Mufa/redukcja 200/150"},{"$nulls":3},4,{"$f":"VLOOKUP(AH206,rozdzial,4,0)*AL206*(1-$AM$236/100)","v":{"v":288.8,"d":"288.80 zł"}}]
[{"$nulls":23},"Do bezpośredniego podłączenia kanału izolowanego 200/174",{"$nulls":9},"Do przyłączenia kanału 200/174 do króćców centrali"]
[{"$nulls":23},{"$f":"VLOOKUP(X206,rozdzial,3,0)","v":7663729},{"$f":"VLOOKUP(X206,rozdzial,4,0)","v":{"v":299,"d":"299.00 zł"}},{"$nulls":8},{"$f":"VLOOKUP(AH206,rozdzial,3,0)","v":7546075},{"$f":"VLOOKUP(AH206,rozdzial,4,0)","v":{"v":76,"d":"76.00 zł"}}]
{"$rows_empty":7}
[{"$nulls":22},"Elementy uzupełniające"]
[]
[]
[]
[{"$nulls":23},{"$f":"'Elementy DN75&90'!D57","v":"Nóż do cięcia kanałów płaskich i okrągłych"},{"$nulls":4},0,{"$f":"VLOOKUP(X220,rozdzial75,4,0)*AC220*(1-$AM$236/100)","v":{"v":0,"d":"0.00 zł"}},{"$nulls":3},{"$f":"'Elementy DN75&90'!D45","v":"Łącznik kanałów DN90"},{"$nulls":3},0,{"$f":"VLOOKUP(AH220,rozdzial75,4,0)*AL220*(1-$AM$236/100)","v":{"v":0,"d":"0.00 zł"}}]
[{"$nulls":23},"Do szybkiego i precyzyjnego obcinania rur",{"$nulls":9},"Do szczelnego łączenia kanałów elastycznych DN63"]
[{"$nulls":23},{"$f":"VLOOKUP(X220,rozdzial75,3,0)","v":7372852},{"$f":"VLOOKUP(X220,rozdzial75,4,0)","v":{"v":319,"d":"319.00 zł"}},{"$nulls":8},{"$f":"VLOOKUP(AH220,rozdzial75,3,0)","v":7372826},{"$f":"VLOOKUP(AH220,rozdzial75,4,0)","v":{"v":77,"d":"77.00 zł"}}]
[]
[]
[{"$nulls":23},"Kolano izolowane z mufą 45 stopni",{"$nulls":4},0,{"$f":"VLOOKUP(X225,rozdzial,4,0)*AC225*(1-$AM$236/100)","v":{"v":0,"d":"0.00 zł"}},{"$nulls":3},{"$f":"'Elementy DN75&90'!D47","v":"Kolano 90, DN90"},{"$nulls":3},0,{"$f":"VLOOKUP(AH225,rozdzial75,4,0)*AL225*(1-$AM$236/100)","v":{"v":0,"d":"0.00 zł"}}]
[{"$nulls":23},"Do zmiany kierunku kanałów izolowanych 200/174",{"$nulls":9},{"$f":"'Elementy DN75&90'!H46","v":"Do zmiany kierunki w ciasnych miejscach, możliwość przycięcia i podłączenia wrost do rozdzielacza"}]
[{"$nulls":23},{"$f":"VLOOKUP(X225,rozdzial,3,0)","v":7546072},{"$f":"VLOOKUP(X225,rozdzial,4,0)","v":{"v":131,"d":"131.00 zł"}}]
[{"$nulls":33},{"$f":"VLOOKUP(AH225,rozdzial75,3,0)","v":7372924},{"$f":"VLOOKUP(AH225,rozdzial75,4,0)","v":{"v":135,"d":"135.00 zł"}}]
[]
[{"$nulls":23},"Mufa łącząca 200/200",{"$nulls":4},0,{"$f":"VLOOKUP(X230,rozdzial,4,0)*AC230*(1-$AM$236/100)","v":{"v":0,"d":"0.00 zł"}},{"$nulls":3},"Trójnik izolowany 200/174 bez mufy",{"$nulls":3},{"$f":"AK232","v":0},{"$f":"VLOOKUP(AH230,rozdzial,4,0)*AL230*(1-$AM$236/100)","v":{"v":0,"d":"0.00 zł"}}]
[{"$nulls":33},"Do rozdzielenia kanału izolowanego 200/174"]
[{"$nulls":23},{"$f":"VLOOKUP(X230,rozdzial,3,0)","v":7546073},{"$f":"VLOOKUP(X230,rozdzial,4,0)","v":{"v":61,"d":"61.00 zł"}},{"$nulls":8},{"$f":"VLOOKUP(AH230,rozdzial,3,0)","v":7775845},{"$f":"VLOOKUP(AH230,rozdzial,4,0)","v":{"v":800,"d":"800.00 zł"}},null,{"$f":"AL177+AL187","v":0}]
[]
[]
[null,null,{"$f":"Dane!S241","v":"Autor:"},{"$nulls":4},{"$f":"Dane!T241","v":"PanD, 2023"},{"$nulls":27},"Cena:",{"$f":"AD137+IFERROR(VLOOKUP(X145,rozdzial,4,0),0)+AD154+IFERROR(VLOOKUP(X158,rozdzial,4,0),0)+AD167+AM167+AM172+AD172+AD177+AM177+AD182+AD201+AD206+AM201+AM206+AD220+AM220+AD225+AM225+AM230+AD230+AD187+AD192+AM182+AM187+AM192","v":{"v":27049.750000000004,"d":"27,049.75 zł"}},null,{"$f":"\"R \"&AM236&\" %\"","v":"R 5 %"},null,"(rabat na system)"]
[{"$nulls":38},5]
[]
[{"$nulls":40},{"$f":"IF(Obliczenia!AP10<>0,Obliczenia!AP10,\"\")","v":""}]
[]
[{"$nulls":40},{"$f":"IF(Obliczenia!AP11<>0,Obliczenia!AP11,\"\")","v":3}]
[]
[{"$nulls":40},{"$f":"IF(Obliczenia!AP12<>0,Obliczenia!AP12,\"\")","v":4}]
[]
[{"$nulls":40},{"$f":"IF(Obliczenia!AP13<>0,Obliczenia!AP13,\"\")","v":""}]
[]
[]
[]
[]
[]
[]
[{"$nulls":40},{"$f":"IF(Obliczenia!AP14<>0,Obliczenia!AP14,\"\")","v":""}]
[{"$nulls":40},{"$f":"IF(Obliczenia!AP15<>0,Obliczenia!AP15,\"\")","v":""}]
[{"$nulls":40},{"$f":"IF(Obliczenia!AP16<>0,Obliczenia!AP16,\"\")","v":""}]
[{"$nulls":40},{"$f":"IF(Obliczenia!AP17<>0,Obliczenia!AP17,\"\")","v":""}]
[{"$nulls":40},{"$f":"IF(Obliczenia!AP18<>0,Obliczenia!AP18,\"\")","v":""}]

{"sheet":"Centrala Vitovent","index":4,"n_rows":149,"n_cols":38,"rows_kept":149,"merged":[[1,1,1,6],[3,1,3,6],[5,8,5,10],[5,15,5,18],[37,1,37,6],[39,8,39,10],[39,15,39,18],[111,1,111,12],[126,1,126,12],[132,1,132,12]]}
[]
[null,"Centrala wentylacyjna Vitovent 300-W"]
[]
[null,"wersja LEWA"]
[]
[{"$nulls":8},"typ",{"$nulls":6},"Wersja Lewa",{"$nulls":21},"Centrala Vitovent model B300/B400 (do 08-2020)"]
[{"$nulls":8},"H32S C225","H32S C325","H32S C400"]
[{"$nulls":8},"DN125","DN160","DN180",1,"Króciec do czerpni (powietrze świeże z zewnątrz) "]
[]
[{"$nulls":8},"DN125","DN160","DN180",2,"Króciec powietrza wywiewanego z pomieszczeń"]
[]
[{"$nulls":8},"DN125","DN160","DN180",3,"Króciec do wyrzutni (powietrze zużyte na zewnątrz)"]
[]
[{"$nulls":8},"DN125","DN160","DN180",4,"Króciec powietrza nawiewanego do pomieszczeń"]
[]
[{"$nulls":11},5,"Klapa bypass (100%) do pracy z pominięciem wymiennika"]
[]
[{"$nulls":11},6,"Grzałka elektryczna, modulowana 125-1000 [W] powietrza świeżego"]
[]
[{"$nulls":8},"G4","G4","G4",7,"Filtr powietrza usuwanego z pomieszczeń"]
[]
[{"$nulls":8},"G4","G4","G4",8,"Filtr powietrza świeżego z zewnątrz"]
[]
[{"$nulls":8},{"v":0.9,"d":"90%"},{"v":0.9,"d":"90%"},{"v":0.93,"d":"93%"},9,"Krzyżowy wymiennik ciepła"]
[]
[{"$nulls":11},10,"Energooszczędne wentylatory promieniowe prądu stałego"]
[]
[{"$nulls":8},"1¼","1¼","1¼",11,"Odprowadzenie kondensatu"]
[]
[{"$nulls":11},12,"Moduł obsługowy LB1 do sterowania i parametryzowania pracy"]
[]
[{"$nulls":11},13,"Przewód komunikacyjny Mod-bus do sterowania centralną z regulatora pompy ciepła"]
[]
[{"$nulls":11},14,"Komunikacja centrali Vitovent z pompą ciepła przewodem Mod-bus umożliwia sterowanie przez aplikację ViCare"]
[]
[]
[]
[null,"wersja PRAWA"]
[]
[{"$nulls":8},"typ",{"$nulls":6},"Wersja Prawa"]
[{"$nulls":8},"H32S C225","H32S C325","H32S C400"]
[{"$nulls":8},"DN125","DN160","DN180",1,"Króciec do czerpni (powietrze świeże z zewnątrz) "]
[]
[{"$nulls":8},"DN125","DN160","DN180",2,"Króciec powietrza wywiewanego z pomieszczeń"]
[]
[{"$nulls":8},"DN125","DN160","DN180",3,"Króciec do wyrzutni (powietrze zużyte na zewnątrz)"]
[]
[{"$nulls":8},"DN125","DN160","DN180",4,"Króciec powietrza nawiewanego do pomieszczeń"]
[]
[{"$nulls":11},5,"Klapa bypass (100%) do pracy z pominięciem wymiennika"]
[]
[{"$nulls":11},6,"Grzałka elektryczna, modulowana 125-1000 [W] powietrza świeżego"]
[]
[{"$nulls":8},"G4","G4","G4",7,"Filtr powietrza usuwanego z pomieszczeń"]
[]
[{"$nulls":8},"G4","G4","G4",8,"Filtr powietrza świeżego z zewnątrz"]
[]
[{"$nulls":8},{"v":0.9,"d":"90%"},{"v":0.9,"d":"90%"},{"v":0.93,"d":"93%"},9,"Krzyżowy wymiennik ciepła"]
[]
[{"$nulls":11},10,"Energooszczędne wentylatory promieniowe prądu stałego"]
[]
[{"$nulls":8},"1¼","1¼","1¼",11,"Odprowadzenie kondensatu"]
[]
[{"$nulls":11},12,"Moduł obsługowy LB1 do sterowania i parametryzowania pracy"]
[]
[{"$nulls":11},13,"Przewód komunikacyjny Mod-bus do sterowania centralną z regulatora pompy ciepła"]
[]
[{"$nulls":11},14,"Komunikacja centrali Vitovent z pompą ciepła przewodem Mod-bus umożliwia sterowanie przez aplikację ViCare"]
{"$rows_empty":43}
[null,"Uwagi i zalecenia dotyczące instalacji rozprowadzania powietrza"]
[{"$nulls":18},"300m3/h"]
[null,"• Ewentualny kominek będzie pobierał powietrze do spalania odzielnym kanałem z zewnątrz"]
[null,"• Okap kuchenny będzie pracował na powietrzu obiegowym",{"$nulls":16},"m3/h","W"]
[null,"• Dokładne lokalizacje nawieników i wywiewników, należy ustalić w koordynacji z innymi branżami oraz aranżacją wnętrz",{"$nulls":16},300,52,300,52]
[null,"• Inwestor zapewni 80mm przestrzeni w warstwach posadzkowych na system kanałów wentylacyjnych",{"$nulls":16},100,7,100,7]
[null,"• Zaprojektować przewody rurowe tak, aby się nie krzyżowały.",{"$nulls":16},"a=","b=","a=","b="]
[null,"• Czerpnia i wyrzutnia elewacyjne będą zlokalizowane, co najmniej 2 m ponad poziomem terenu",{"$nulls":16},{"$f":"(T116-T117)/(200)","v":0.225},{"$f":"T117-S119*S117","v":-15.5},{"$f":"(V117-V116)/(-200)","v":0.225},{"$f":"V116-U119*U116","v":-15.5}]
[null,"• Rozdzielacze będę zlokalizowane bezpośrednio na stropie parteru, wewnątrz izolacji termicznej spełniającej warunki paroszczelności"]
[null,"• Przewodów DN 63 bez izolacji nie wolno prowadzić w przestrzeni powietrznej poddasza"]
[null,"• Nie stosować dłuższych odcinków przewodów DN63 niż 25m"]
[null,"• Aby umożliwić przepływ powietrza z obszarów nawiewnych do obszarów wywiewnych, należy zapewnić szczeliną pod drzwiami."]
[null,"• Podczas montażu instalacji wentylacji należy systematycznie zaślepiać wszystkie otwory, aby zabezpieczyć ją przed zapyleniem."]
[null,"• Zaleca się stosowanie tłumików na odcinku od centrali wentylacyjnej do rozdzielacza powietrza nawiewanego do pomieszczeń"]
[]
[null,"Uwagi i zalecenia dotyczące centrali wentylacyjnej"]
[]
[null,"• Centralę wentylacyjną należy ustawiać wewnątrz pomieszczeń ogrzewanych"]
[null,"• Centralę wentylacyjną można zamontować w pozycji stojącej lub wiszącej"]
[null,"• Należy zapewnić swobodny dostęp do centrali wentylacyjnej w celu wykonania prac konserwacyjnych"]
[]
[null,"Uwagi i zalecenia dotyczące eksploatacji centrali wentylacyjnej"]
[]
[null,"• Panel zdalnego sterowania należy umieścić w ogólnodostępnym miejscu"]
[null,"• Należy kontrolować jakość filtrów i w razie konieczności wymienić na nowe"]
[]
[]
[]
[]
[]
[]
[{"$nulls":18},"400m3/h"]
[]
[{"$nulls":18},"m3/h","W"]
[{"$nulls":18},400,83,400,83]
[{"$nulls":18},300,40,300,40]
[{"$nulls":18},"a=","b=","a=","b="]
[{"$nulls":18},{"$f":"(T147-T146)/(-100)","v":0.43},{"$f":"T146-S149*S146","v":-89},{"$f":"(V147-V146)/(-100)","v":0.43},{"$f":"V146-U149*U146","v":-89}]

{"sheet":"Centrala Vitoair FS","index":5,"n_rows":2,"n_cols":2,"rows_kept":2,"merged":[[1,1,1,6]]}
[]
[null,"Centrala wentylacyjna Vitovent 300-W"]

{"sheet":"Elementy DN63","index":6,"n_rows":103,"n_cols":25,"rows_kept":103}
[]
[{"$nulls":3},"Nazwa materiału","Jednostka","Nr zamówieniowy","Cena 04/23","Cena 04/23"]
[null,null,0,"Vitovent 300-W 325m3/h lewa","szt.","Z019041",{"v":12364,"d":"12,364.00 zł"},{"v":12364,"d":"12,364.00 zł"},1]
[{"$nulls":3},"Vitovent 300-W 325m3/h prawa","szt.","Z019040",{"v":12364,"d":"12,364.00 zł"},{"v":12364,"d":"12,364.00 zł"}]
[null,null,1,"Vitovent 300-W 400m3/h lewa","szt.","Z019043",{"v":13085,"d":"13,085.00 zł"},{"v":13085,"d":"13,085.00 zł"},2]
[{"$nulls":3},"Vitovent 300-W 400m3/h prawa","szt.","Z019042",{"v":13085,"d":"13,085.00 zł"},{"v":13085,"d":"13,085.00 zł"}]
[null,null,2,"Vitovent 300-W 225m3/h lewa","szt.","Z021837",{"v":10908,"d":"10,908.00 zł"},{"v":10908,"d":"10,908.00 zł"}]
[{"$nulls":3},"Vitovent 300-W 225m3/h prawa","szt.","Z021838",{"v":10908,"d":"10,908.00 zł"},{"v":10908,"d":"10,908.00 zł"}]
[{"$nulls":3},"Vitovent 300-W 600m3/h lewa","szt.","Z026466",{"v":15886,"d":"15,886.00 zł"},{"v":15886,"d":"15,886.00 zł"}]
[{"$nulls":3},"Vitovent 300-W 600m3/h prawa","szt.","Z026465",{"v":15886,"d":"15,886.00 zł"},{"v":15886,"d":"15,886.00 zł"}]
[{"$nulls":3},"Vitoair FS 300E MA 300m3/h","szt.","Z023297",{"v":12577,"d":"12,577.00 zł"},{"v":12577,"d":"12,577.00 zł"}]
[{"$nulls":3},"Nagrzewnica elektryczna powietrza 1,8kW","szt.",7372079,{"v":1822,"d":"1,822.00 zł"},{"v":1822,"d":"1,822.00 zł"}]
[{"$nulls":3},"Przewód komunikacyjny Can-Bus 5m","szt.","ZK06219",{"v":153,"d":"153.00 zł"},{"v":153,"d":"153.00 zł"}]
[{"$nulls":3},"Przewód komunikacyjny Can-Bus 15m","szt.","ZK06220",{"v":229,"d":"229.00 zł"},{"v":229,"d":"229.00 zł"}]
[{"$nulls":3},"Przewód komunikacyjny Can-Bus 30m","szt.","ZK06221",{"v":525,"d":"525.00 zł"},{"v":525,"d":"525.00 zł"}]
[{"$nulls":3},"Vitotrol 300-E","szt.",7959522,{"v":1436,"d":"1,436.00 zł"},{"v":1436,"d":"1,436.00 zł"}]
[{"$nulls":3},"Zasilacz do 300-E do montażu podtynkowego","szt.","ZK03842",{"v":308,"d":"308.00 zł"},{"v":308,"d":"308.00 zł"}]
[{"$nulls":3},"Przełącznik 4-stopniowy","szt.",7372092,{"v":649,"d":"649.00 zł"},{"v":649,"d":"649.00 zł"}]
[null,null,3,"Moduł obsługowy ścienny LB1","szt.","Z015318",{"v":1586,"d":"1,586.00 zł"},{"v":1586,"d":"1,586.00 zł"},3]
[null,null,4,"Przewód połączeniowy Vitocal (WO1C)","szt.","ZK02789",{"v":107,"d":"107.00 zł"},{"v":107,"d":"107.00 zł"},4]
[null,null,5,"Czujnik wilgotności","szt.","ZK02539",{"v":1449,"d":"1,449.00 zł"},{"v":1449,"d":"1,449.00 zł"},5]
[null,null,6,"Czujnik CO2/wilgoci","szt.",7501978,{"v":1826,"d":"1,826.00 zł"},{"v":1826,"d":"1,826.00 zł"},6]
["do 20m3 3 Pa, do 25 m3/h 4 Pa/m",null,7,"Elastyczny kanał okrągły DN63","50m/rolka",7732939,{"v":529,"d":"529.00 zł"},{"v":529,"d":"529.00 zł"},7,{"$nulls":15},"asd"]
["10 Pa",null,8,"Skrzynka do anemostatu","szt.",7546057,{"v":316,"d":"316.00 zł"},{"v":316,"d":"316.00 zł"},8]
[null,null,9,"Element usztywniający do skrzynki anemostatu","szt.",7634370,{"v":11.8,"d":"11.80 zł"},{"v":11.8,"d":"11.80 zł"}]
[null,null,10,"Anemostat metalowy nawiewny","szt.",7546059,{"v":61,"d":"61.00 zł"},{"v":61,"d":"61.00 zł"}]
[null,null,11,"Anemostat metalowy wywiewny","szt.",7546060,{"v":49.9,"d":"49.90 zł"},{"v":49.9,"d":"49.90 zł"},9]
[null,null,12,"Skrzynka rozdzielcza 18x63","szt.",7546061,{"v":1172,"d":"1,172.00 zł"},{"v":1172,"d":"1,172.00 zł"},10]
["10 Pa",null,13,"Skrzynka rozdzielcza 12x63","szt.",7546062,{"v":1002,"d":"1,002.00 zł"},{"v":1002,"d":"1,002.00 zł"},11]
["10 Pa",null,14,"Tłumik dźwięku, giętki; 1,1m; DN180; 25mm","szt.",{"$nulls":3},12]
[null,null,15,"Tłumik dźwięku, giętki; 1,1m; DN180; 50mm","szt.","ZK03037",{"v":651,"d":"651.00 zł"},{"v":651,"d":"651.00 zł"},13]
[null,null,16,"Kratka 200x100 podłączenie z góry","szt.",7546065,{"v":520,"d":"520.00 zł"},{"v":520,"d":"520.00 zł"},14]
[null,null,17,"Kratka 200x100 podłączenie z tyłu","szt.",7546066,{"v":520,"d":"520.00 zł"},{"v":520,"d":"520.00 zł"},15]
[null,null,18,"Łącznik kanałów DN63","szt.",7546067,{"v":39.2,"d":"39.20 zł"},{"v":39.2,"d":"39.20 zł"},16]
[null,null,19,"Nóż do kanałów DN63","szt.",7546068,{"v":296,"d":"296.00 zł"},{"v":296,"d":"296.00 zł"},17]
[null,null,20,"Uchwyt mocujący do kanałów DN63","szt.",7546069,{"v":8,"d":"8.00 zł"},{"v":8,"d":"8.00 zł"},18]
[null,null,21,"Kanał izolowany 200/174","2m/szt.",7546070,{"v":396,"d":"396.00 zł"},{"v":396,"d":"396.00 zł"},19]
["4 Pa/m",null,22,"Kolano izolowane z mufą 90 stopni","szt.",7546071,{"v":179,"d":"179.00 zł"},{"v":179,"d":"179.00 zł"},20]
["5 Pa/m",null,23,"Kolano izolowane z mufą 45 stopni","szt.",7546072,{"v":131,"d":"131.00 zł"},{"v":131,"d":"131.00 zł"},21]
[null,null,24,"Trójnik izolowany 200/174 bez mufy","szt.",7775845,{"v":800,"d":"800.00 zł"},{"v":800,"d":"800.00 zł"}]
["3 Pa/m",null,25,"Mufa łącząca 200/200","szt.",7546073,{"v":61,"d":"61.00 zł"},{"v":61,"d":"61.00 zł"},22]
[null,null,26,"Mufa/redukcja 200/180","szt.",7546074,{"v":75,"d":"75.00 zł"},{"v":75,"d":"75.00 zł"},23]
[null,null,27,"Mufa/redukcja 200/150","szt.",7546075,{"v":76,"d":"76.00 zł"},{"v":76,"d":"76.00 zł"},24]
[null,null,28,"Czerpnia/wyrzutnia ścienna z rurą","szt.",7663729,{"v":299,"d":"299.00 zł"},{"v":299,"d":"299.00 zł"},25]
[null,null,29,"Czerpnia/wyrzutnia ścienna","szt.",7546076,{"v":368,"d":"368.00 zł"},{"v":368,"d":"368.00 zł"},26]
["15 Pa",null,30,"Wyrzutnia dachowa","szt.",7547618,{"v":851,"d":"851.00 zł"},{"v":851,"d":"851.00 zł"},27]
[null,null,31,"Króciec przyłączeniowy do przedłużania DN125","szt.",7546058,{"v":34,"d":"34.00 zł"},{"v":34,"d":"34.00 zł"},28]
{"$rows_empty":31}
[null,null,"Uwagi i zalecenia dotyczące instalacji rozprowadzania powietrza"]
[]
[null,null,"• Ewentualny kominek będzie pobierał powietrze do spalania odzielnym kanałem z zewnątrz"]
[null,null,"• Okap kuchenny będzie pracował na powietrzu obiegowym"]
[null,null,"• Dokładne lokalizacje nawieników i wywiewników, należy ustalić w koordynacji z innymi branżami oraz aranżacją wnętrz"]
[null,null,"• Inwestor zapewni 80mm przestrzeni w warstwach posadzkowych na system kanałów wentylacyjnych"]
[null,null,"• Zaprojektować przewody rurowe tak, aby się nie krzyżowały."]
[null,null,"• Czerpnia i wyrzutnia elewacyjne będą zlokalizowane, co najmniej 2 m ponad poziomem terenu"]
[null,null,"• Rozdzielacze będę zlokalizowane bezpośrednio na stropie parteru, wewnątrz izolacji termicznej spełniającej warunki paroszczelności"]
[null,null,"• Przewodów DN 63 bez izolacji nie wolno prowadzić w przestrzeni powietrznej poddasza"]
[null,null,"• Nie stosować dłuższych odcinków przewodów DN63 niż 25m"]
[null,null,"• Aby umożliwić przepływ powietrza z obszarów nawiewnych do obszarów wywiewnych, należy zapewnić szczeliną pod drzwiami."]
[null,null,"• Podczas montażu instalacji wentylacji należy systematycznie zaślepiać wszystkie otwory, aby zabezpieczyć ją przed zapyleniem."]
[null,null,"• Zaleca się stosowanie tłumików na odcinku od centrali wentylacyjnej do rozdzielacza powietrza nawiewanego do pomieszczeń"]
[]
[null,null,"Uwagi i zalecenia dotyczące centrali wentylacyjnej"]
[]
[null,null,"• Centralę wentylacyjną należy ustawiać wewnątrz pomieszczeń ogrzewanych"]
[null,null,"• Centralę wentylacyjną można zamontować w pozycji stojącej lub wiszącej"]
[null,null,"• Należy zapewnić swobodny dostęp do centrali wentylacyjnej w celu wykonania prac konserwacyjnych"]
[]
[null,null,"Uwagi i zalecenia dotyczące eksploatacji centrali wentylacyjnej"]
[]
[null,null,"• Panel zdalnego sterowania należy umieścić w ogólnodostępnym miejscu"]
[null,null,"• Należy kontrolować jakość filtrów i w razie konieczności wymienić na nowe"]

{"sheet":"Elementy DN75&90","index":7,"n_rows":149,"n_cols":25,"rows_kept":149}
[]
[{"$nulls":3},"Nazwa materiału, przewody główne centrali","Jednostka","Nr zamówieniowy","Cena \n01/23","Opis"]
[null,null,0,"Tłumik dźwięku DN125, L=1,1m, 50mm","szt.",7249105,{"v":627,"d":"627.00 zł"},null,1]
[{"$nulls":3},"Tłumik dźwięku DN160, L=1,1m, 50mm","szt.","ZK03036",{"v":596,"d":"596.00 zł"}]
[{"$nulls":3},"Tłumik dźwięku DN180, L=1,1m, 50 mm","szt.","ZK03037",{"v":651,"d":"651.00 zł"},null,2]
[null,null,1,"Rura z mufą łączącą z EPP DN=125, L=1m","szt.",7501764,{"v":127,"d":"127.00 zł"}]
[{"$nulls":3},"Rura z mufą łączącą z EPP DN=160, L=1m","szt.",7501765,{"v":177,"d":"177.00 zł"}]
[{"$nulls":3},"Rura z mufą łączącą z EPP DN=180, L=1m","szt.",7501766,{"v":217,"d":"217.00 zł"}]
[null,null,2,"Kolano 90° z mufą łączącą z EPP, DN125","szt.",7501767,{"v":88,"d":"88.00 zł"},"Z możliwością podziału i stosowania jako konalo 45",3]
[{"$nulls":3},"Kolano 90° z mufą łączącą z EPP, DN160","szt.",7501768,{"v":127,"d":"127.00 zł"},"Z możliwością podziału i stosowania jako konalo 45",4]
[{"$nulls":3},"Kolano 90° z mufą łączącą z EPP, DN180","szt.",7501769,{"v":163,"d":"163.00 zł"},"Z możliwością podziału i stosowania jako konalo 45",5]
[null,null,3,"Mufa łącząca z EPP DN125","szt.",7501770,{"v":38.7,"d":"38.70 zł"},null,6]
["do 20m3 3 Pa, do 25 m3/h 4 Pa/m",null,null,"Mufa łącząca z EPP DN160","szt.",7501771,{"v":40.1,"d":"40.10 zł"},null,7,{"$nulls":15},"asd"]
["10 Pa",null,null,"Mufa łącząca z EPP DN180","szt.",7501772,{"v":43.6,"d":"43.60 zł"},null,8]
[null,null,"3A","Mufa łącząca, przesuwna z EPP DN125","szt.","ZK01770",{"v":136,"d":"136.00 zł"},"Do  późniejszego demontażu systemu rozdziału powietrza"]
[{"$nulls":3},"Mufa łącząca, przesuwna z EPP DN160","szt.","ZK01890",{"v":145,"d":"145.00 zł"},"Do  późniejszego demontażu systemu rozdziału powietrza"]
[{"$nulls":3},"Mufa łącząca, przesuwna z EPP DN180","szt.","ZK01891",{"v":145,"d":"145.00 zł"},"Do  późniejszego demontażu systemu rozdziału powietrza",9]
[{"$nulls":3},"Kabłąk mocujący do ściany lub stropu","szt.",7501773,{"v":80,"d":"80.00 zł"},null,10]
["10 Pa",null,4,"Przpust przez ścianę zewnętrzną EPP DN125","szt.","ZK03025",{"v":319,"d":"319.00 zł"},null,11]
["10 Pa",null,null,"Przpust przez ścianę zewnętrzną EPP DN160","szt.","ZK03026",{"v":303,"d":"303.00 zł"},null,12]
[{"$nulls":3},"Przpust przez ścianę zewnętrzną EPP DN180","szt.","ZK03027",{"v":340,"d":"340.00 zł"},null,13]
[null,null,"5XS","Skrzynka rozdzielacza XS","szt.",7377369,{"v":999,"d":"999.00 zł"},"Zintegrowany tłumik hałasów, montaż płyty przyłączeniowej z przodu lub od góry, 266 x 328 x 249"]
[null,null,"5S","Skrzynka rozdzielacza S","szt.",7377372,{"v":1062,"d":"1,062.00 zł"},"Zintegrowany tłumik hałasów, montaż płyty przyłączeniowej z przodu lub od góry, 360 x 238 x 249"]
[null,null,"5M","Skrzynka rozdzielacza M","szt.",7377375,{"v":1115,"d":"1,115.00 zł"},"Zintegrowany tłumik hałasów, montaż płyty przyłączeniowej z przodu lub od góry, 470 x 238 x 249"]
[null,null,"5L","Skrzynka rozdzielacza L","szt.",7377378,{"v":1167,"d":"1,167.00 zł"},"Zintegrowany tłumik hałasów, montaż płyty przyłączeniowej z przodu lub od góry, 582 x 238 x 249"]
[null,null,"5XL","Skrzynka rozdzielacza XL","szt.",7377381,{"v":1863,"d":"1,863.00 zł"},"Zintegrowany tłumik hałasów, montaż płyty przyłączeniowej z przodu lub od góry, 695 x 238 x 249"]
[null,null,"6XS","Płyta przyłączeniowa XS 4 kanały DN75","szt.",7377370,{"v":649,"d":"649.00 zł"},"Do montażu w module skrzynki rozdzielaczowej typu XS, w zakresie dostawy 1 korek zaślepiający",14]
[null,null,"6S","Płyta przyłączeniowa S 6 kanały DN75","szt.",7377373,{"v":691,"d":"691.00 zł"},"Do montażu w module skrzynki rozdzielaczowej typu S, w zakresie dostawy 1 korek zaślepiający",15]
[null,null,"6M","Płyta przyłączeniowa M 8 kanałów DN75",null,7377376,{"v":860,"d":"860.00 zł"},"Do montażu w module skrzynki rozdzielaczowej typu M, w zakresie dostawy 1 korek zaślepiający"]
[null,null,"6L","Płyta przyłączeniowa L 10 kanałów DN75",null,7377379,{"v":1122,"d":"1,122.00 zł"},"Do montażu w module skrzynki rozdzielaczowej typu L, w zakresie dostawy 1 korek zaślepiający"]
[null,null,"6XL","Płyta przyłączeniowa XL 12 kanałów DN75",null,7377382,{"v":1417,"d":"1,417.00 zł"},"Do montażu w module skrzynki rozdzielaczowej typu XL, w zakresie dostawy 1 korek zaślepiający"]
[null,null,"7XS","Płyta przyłączeniowa XS 4 kanały DN90","szt.",7377371,{"v":646,"d":"646.00 zł"},"Do montażu w module skrzynki rozdzielaczowej typu XS, w zakresie dostawy 1 korek zaślepiający"]
[null,null,"7S","Płyta przyłączeniowa S 6 kanały DN90","szt.",7377374,{"v":693,"d":"693.00 zł"},"Do montażu w module skrzynki rozdzielaczowej typu S, w zakresie dostawy 1 korek zaślepiający"]
[null,null,"7M","Płyta przyłączeniowa M 8 kanałów DN90",null,7377377,{"v":850,"d":"850.00 zł"},"Do montażu w module skrzynki rozdzielaczowej typu M, w zakresie dostawy 1 korek zaślepiający"]
[null,null,"7L","Płyta przyłączeniowa L 10 kanałów DN90",null,7377380,{"v":1130,"d":"1,130.00 zł"},"Do montażu w module skrzynki rozdzielaczowej typu L, w zakresie dostawy 1 korek zaślepiający"]
[null,null,"7XL","Płyta przyłączeniowa XL 12 kanałów DN90",null,7377383,{"v":1426,"d":"1,426.00 zł"},"Do montażu w module skrzynki rozdzielaczowej typu XL, w zakresie dostawy 1 korek zaślepiający"]
[null,null,8,"Element przyłączeniowy rozdzielacza DN125","szt.","ZK01866",{"v":118,"d":"118.00 zł"},"Do przyłączenia kanału powietrza do rozdzielacza",16]
[{"$nulls":3},"Element przyłączeniowy rozdzielacza DN160","szt.","ZK01867",{"v":118,"d":"118.00 zł"},"Do przyłączenia kanału powietrza do rozdzielacza",17]
[{"$nulls":3},"Element przyłączeniowy rozdzielacza DN180","szt.","ZK01868",{"v":118,"d":"118.00 zł"},"Do przyłączenia kanału powietrza do rozdzielacza",18]
[null,null,9,"Kanał elastyczny okrągły DN75, 25 m","szt.","Z023107",{"v":494,"d":"494.00 zł"},"Krąg o długości 25 m, nadrukowane znaczniki długości, powierzchnia antybakteryjna i antystatyczna",19]
["4 Pa/m",null,null,"Kanał elastyczny okrągły DN75, 50 m","szt.","Z023108",{"v":968,"d":"968.00 zł"},"Krąg o długości 50 m, nadrukowane znaczniki długości, powierzchnia antybakteryjna i antystatyczna",20]
[null,null,"9A","Kanał elastyczny okrągły DN90, 25 m","szt.","Z023110",{"v":661,"d":"661.00 zł"},"Krąg o długości 25 m, nadrukowane znaczniki długości, powierzchnia antybakteryjna i antystatyczna"]
[{"$nulls":3},"Kanał elastyczny okrągły DN90, 50 m","szt.","Z023111",{"v":1305,"d":"1,305.00 zł"},"Krąg o długości 50 m, nadrukowane znaczniki długości, powierzchnia antybakteryjna i antystatyczna"]
["5 Pa/m",null,10,"Łącznik kanałów DN75","szt.",7372825,{"v":66,"d":"66.00 zł"},"Do połączenia dwóch kanałów powietrza DN75",21]
[{"$nulls":3},"Łącznik kanałów DN90","szt.",7372826,{"v":77,"d":"77.00 zł"},"Do połączenia dwóch kanałów powietrza DN75"]
[null,null,11,"Kolano 90, DN75","szt.",7372923,{"v":135,"d":"135.00 zł"},"Do zmiany kierunki w ciasnych miejscach, możliwość przycięcia i podłączenia wrost do rozdzielacza"]
[{"$nulls":3},"Kolano 90, DN90","szt.",7372924,{"v":135,"d":"135.00 zł"},"Do zmiany kierunki w ciasnych miejscach, możliwość przycięcia i podłączenia wrost do rozdzielacza"]
["3 Pa/m",null,12,"Skrzynka rozprężna DN125 dla 2 kanałów DN75","szt.",7377341,{"v":166,"d":"166.00 zł"},"2 króćce przyłączeniowe DN75",22]
[null,null,13,"Skrzynka rozprężna DN125, prosta dla 2 kanałów DN75","szt.",7377351,{"v":197,"d":"197.00 zł"},"2 króćce przyłączeniowe DN75",24]
[{"$nulls":3},"Skrzynka rozprężna DN125 dla 1 kanału DN90","szt.",7377343,{"v":166,"d":"166.00 zł"},"1 króciec przyłączeniowy DN90"]
[{"$nulls":3},"Skrzynka rozprężna DN125, prosta dla 2 kanałów DN90","szt.",7377348,{"v":197,"d":"197.00 zł"},"1 króciec przyłączeniowy DN90",23]
[null,null,14,"Element dławiący okrągły dla skrzynki rozprężnej",null,"ZK01816",{"v":54,"d":"54.00 zł"},"Zalecany w celu wykluczenia odgłosów przepływu powietrza przy dużych różnicach ciśnienia."]
[null,null,15,"Element dławiący okrągły DN75 10 sztuk","szt.",7377367,{"v":186,"d":"186.00 zł"},"Zalecany w celu wykluczenia odgłosów przepływu powietrza przy dużych różnicach ciśnienia."]
[{"$nulls":3},"Element dławiący okrągły DN90 10 sztuk","szt.",7377368,{"v":186,"d":"186.00 zł"},"Zalecany w celu wykluczenia odgłosów przepływu powietrza przy dużych różnicach ciśnienia."]
[null,null,16,"Anemostat nawiewny, biały","szt.","ZK04570",{"v":107,"d":"107.00 zł"},"Do stosowania również jako zawór wywiewny, do 60 m3/h",26]
["15 Pa",null,17,"Anemostat wywiewny, biały","szt.","ZK04571",{"v":95,"d":"95.00 zł"},"Maksymalny przepływ powietrza 60 m3/h",27]
[null,null,18,"Nóż do cięcia kanałów płaskich i okrągłych","szt.",7372852,{"v":319,"d":"319.00 zł"},"Uniwersalny do kanałów okrągłych i płaskich",28]
{"$rows_empty":67}
[null,null,"Uwagi i zalecenia dotyczące instalacji rozprowadzania powietrza"]
[]
[null,null,"• Ewentualny kominek będzie pobierał powietrze do spalania odzielnym kanałem z zewnątrz"]
[null,null,"• Okap kuchenny będzie pracował na powietrzu obiegowym"]
[null,null,"• Dokładne lokalizacje nawieników i wywiewników, należy ustalić w koordynacji z innymi branżami oraz aranżacją wnętrz"]
[null,null,"• Inwestor zapewni 80mm przestrzeni w warstwach posadzkowych na system kanałów wentylacyjnych"]
[null,null,"• Zaprojektować przewody rurowe tak, aby się nie krzyżowały."]
[null,null,"• Czerpnia i wyrzutnia elewacyjne będą zlokalizowane, co najmniej 2 m ponad poziomem terenu"]
[null,null,"• Rozdzielacze będę zlokalizowane bezpośrednio na stropie parteru, wewnątrz izolacji termicznej spełniającej warunki paroszczelności"]
[null,null,"• Przewodów DN 63 bez izolacji nie wolno prowadzić w przestrzeni powietrznej poddasza"]
[null,null,"• Nie stosować dłuższych odcinków przewodów DN63 niż 25m"]
[null,null,"• Aby umożliwić przepływ powietrza z obszarów nawiewnych do obszarów wywiewnych, należy zapewnić szczeliną pod drzwiami."]
[null,null,"• Podczas montażu instalacji wentylacji należy systematycznie zaślepiać wszystkie otwory, aby zabezpieczyć ją przed zapyleniem."]
[null,null,"• Zaleca się stosowanie tłumików na odcinku od centrali wentylacyjnej do rozdzielacza powietrza nawiewanego do pomieszczeń"]
[]
[null,null,"Uwagi i zalecenia dotyczące centrali wentylacyjnej"]
[]
[null,null,"• Centralę wentylacyjną należy ustawiać wewnątrz pomieszczeń ogrzewanych"]
[null,null,"• Centralę wentylacyjną można zamontować w pozycji stojącej lub wiszącej"]
[null,null,"• Należy zapewnić swobodny dostęp do centrali wentylacyjnej w celu wykonania prac konserwacyjnych"]
[]
[null,null,"Uwagi i zalecenia dotyczące eksploatacji centrali wentylacyjnej"]
[]
[null,null,"• Panel zdalnego sterowania należy umieścić w ogólnodostępnym miejscu"]
[null,null,"• Należy kontrolować jakość filtrów i w razie konieczności wymienić na nowe"]

{"sheet":"Obliczenia","index":8,"n_rows":126,"n_cols":61,"rows_kept":126,"hidden":true,"merged":[[3,17,3,38],[3,39,3,49],[3,50,3,60],[4,17,4,27],[4,28,4,38],[4,39,4,49],[4,50,4,60],[29,35,29,36],[29,37,29,38],[29,46,29,47],[29,48,29,49],[29,57,29,58],[29,59,29,60]]}
[]
[null,"Tabela z obliczeniami jako podstwa do każdej kalkulacji"]
[null,1,2,3,4,5,6,7,8,9,10,11,12,13,14,15,16,17,18,19,20,21,22,23,24,25,26,27,28,29,30,31,32,33,34,35,36,37,38,39,40,41,42,43,44,45,46,47,48,49,50,51,52,53,54,55,56,57,58,59,60]
[{"$nulls":17},"Rura 63",{"$nulls":21},"Rura 75",{"$nulls":10},"Rura 90"]
[{"$nulls":17},"normalny 25m3/h",{"$nulls":10},"cichy 20m3/h",{"$nulls":10},"normalny 35m3/h",{"$nulls":10},"normalny 55m3/h"]
["Potrzebne osoby?","Pom.",null,"Typ","Nazwa","Ilość osob","Powierzchnia","Wysokość","Kubatura","Ruch powietrza","Norma","Branża","Wybór","Nawiew","Wskaźnik wymiany","Wywiew","Wskaźnik wymiany","przepływ normalny","Ilość rur (normalny)","Ilość rur (normalny) nawiew","Ilość rur (normalny) wywiew","Ilość zaworów (normalny)","Ilość zaworów (nawiew)","Ilość zaworów (wywiew)","Ilość rozdzielaczy 12x (nawiew)","Ilość rozdzielaczy 18x (nawiew)","Ilość rozdzielaczy 12x (wywiew)","Ilość rozdzielaczy 18x (wywiew)","przepływ cichy","Ilość rur (cichy)","Ilość rur (cichy) nawiew","Ilość rur (cichy) wywiew","Ilość zaworów (cichy)","Ilość zaworów (nawiew)","Ilość zaworów (wywiew)","Ilość rozdzielaczy 12x (nawiew)","Ilość rozdzielaczy 18x (nawiew)","Ilość rozdzielaczy 12x (wywiew)","Ilość rozdzielaczy 18x (wywiew)","przepływ normalny","Ilość rur (normalny)","Ilość rur (normalny) nawiew","Ilość rur (normalny) wywiew","Ilość zaworów (normalny)","Ilość zaworów (nawiew)","Ilość zaworów (wywiew)","Rozmiasr rozdzielacza (nawiew)",null,"Rozmiar rozdzielacza (wywiew)",null,"przepływ normalny","Ilość rur (normalny)","Ilość rur (normalny) nawiew","Ilość rur (normalny) wywiew","Ilość zaworów (normalny)","Ilość zaworów (nawiew)","Ilość zaworów (wywiew)","Rozmiasr rozdzielacza (nawiew)",null,"Rozmiar rozdzielacza (wywiew)"]
[{"$nulls":6},"[m2]","[m]","[m3]",null,"[m3/h]","[m3/h]",null,"[m3/h]","[1/]","[m3/h]","[1/]",25,{"$nulls":21},35,{"$nulls":10},50]
[null,{"$f":"Dane!C32","v":"0.1"},{"$f":"J8","v":"wywiew"},{"$f":"Dane!E32","v":"Wiatrołap"},{"$f":"IF(Dane!E33=\"\",\"\",Dane!E33)","v":"0.1 Wiatrołap"},{"$f":"Dane!G34","v":2},{"$f":"IF(D8<>0,Dane!J33,0)","v":6.9},{"$f":"Dane!L33","v":2.8},{"$f":"G8*H8","v":{"v":19.32,"d":"19"}},{"$f":"IF(D8=0,\"n.d.\",VLOOKUP(D8,lista_pod_rodzaj_ruchu_powietrza,4,0))","v":"wywiew"},{"$f":"IF(J8=\"n.d.\",0,IF(J8=\"nawiew\",F8*20,VLOOKUP(D8,warunki2,3,0)))","v":15},{"$f":"I8","v":{"v":19.32,"d":"19"}},{"$f":"IF(D8<>0,Dane!S33,0)","v":25},{"$f":"IF(J8=\"nawiew\",M8,IF(J8=\"naw.wyw.\",M8,0))","v":0},{"$f":"IF(I8<>0,N8/I8,0)","v":{"v":0,"d":"0.00"}},{"$f":"IF(J8=\"wywiew\",M8,IF(J8=\"naw.wyw.\",M8,0))","v":25},{"$f":"IF(I8<>0,P8/I8,0)","v":{"v":1.2939958592132506,"d":"1.29"}},{"$f":"$R$7","v":25},{"$f":"ROUNDUP(M8/R8,0)","v":1},{"$f":"IF(J8=\"nawiew\",S8,IF(J8=\"naw.wyw.\",S8,0))","v":0},{"$f":"IF(J8=\"wywiew\",S8,IF(J8=\"naw.wyw.\",S8,0))","v":1},{"$f":"ROUNDUP(S8/3,0)","v":1},{"$f":"IF(J8=\"nawiew\",V8,IF(J8=\"naw.wyw.\",V8,0))","v":0},{"$f":"IF(J8=\"wywiew\",V8,IF(J8=\"naw.wyw.\",V8,0))","v":1},{"$nulls":4},20,{"$f":"ROUNDUP(M8/AC8,0)","v":2},{"$f":"IF(J8=\"nawiew\",AD8,IF(J8=\"naw.wyw.\",S8,0))","v":0},{"$f":"IF(J8=\"wywiew\",AD8,IF(J8=\"naw.wyw.\",S8,0))","v":2},{"$f":"ROUNDUP(AD8/3,0)","v":1},{"$f":"IF(J8=\"nawiew\",AG8,IF(J8=\"naw.wyw.\",AG8,0))","v":0},{"$f":"IF(J8=\"wywiew\",AG8,IF(J8=\"naw.wyw.\",AG8,0))","v":1},{"$nulls":4},{"$f":"$AN$7","v":35},{"$f":"ROUNDUP(M8/AN8,0)","v":1},{"$f":"IF(J8=\"nawiew\",AO8,IF(J8=\"naw.wyw.\",AO8,0))","v":0},{"$f":"IF(J8=\"wywiew\",AO8,IF(J8=\"naw.wyw.\",AO8,0))","v":1},{"$f":"ROUNDUP(AO8/2,0)","v":1},{"$f":"IF(J8=\"nawiew\",AR8,IF(J8=\"naw.wyw.\",AR8,0))","v":0},{"$f":"IF(J8=\"wywiew\",AR8,IF(J8=\"naw.wyw.\",AR8,0))","v":1},{"$nulls":4},{"$f":"$AY$7","v":50},{"$f":"ROUNDUP(M8/AY8,0)","v":1},{"$f":"IF(J8=\"nawiew\",AZ8,IF(J8=\"naw.wyw.\",AZ8,0))","v":0},{"$f":"IF(J8=\"wywiew\",AZ8,IF(J8=\"naw.wyw.\",AZ8,0))","v":1},{"$f":"ROUNDUP(AZ8/1,0)","v":1},{"$f":"IF(J8=\"nawiew\",BC8,IF(J8=\"naw.wyw.\",BC8,0))","v":0},{"$f":"IF(J8=\"wywiew\",BC8,IF(J8=\"naw.wyw.\",BC8,0))","v":1}]
[null,{"$f":"Dane!C38","v":"0.2"},{"$f":"J9","v":"wywiew"},{"$f":"Dane!E38","v":"Łazienka"},{"$f":"IF(Dane!E39=\"\",\"\",Dane!E39)","v":"03. Łazienka"},{"$f":"Dane!G40","v":2},{"$f":"IF(D9<>0,Dane!J39,0)","v":4.72},{"$f":"Dane!L39","v":2.8},{"$f":"G9*H9","v":{"v":13.216,"d":"13"}},"wywiew",50,{"v":13.216,"d":"13"},{"$f":"IF(D9<>0,Dane!S39,0)","v":75},{"$f":"IF(J9=\"nawiew\",M9,IF(J9=\"naw.wyw.\",M9,0))","v":0},{"$f":"IF(I9<>0,N9/I9,0)","v":{"v":0,"d":"0.00"}},{"$f":"IF(J9=\"wywiew\",M9,IF(J9=\"naw.wyw.\",M9,0))","v":75},{"$f":"IF(I9<>0,P9/I9,0)","v":{"v":5.674939467312349,"d":"5.67"}},{"$f":"$R$7","v":25},{"$f":"ROUNDUP(M9/R9,0)","v":3},{"$f":"IF(J9=\"nawiew\",S9,IF(J9=\"naw.wyw.\",S9,0))","v":0},3,1,{"$f":"IF(J9=\"nawiew\",V9,IF(J9=\"naw.wyw.\",V9,0))","v":0},{"$f":"IF(J9=\"wywiew\",V9,IF(J9=\"naw.wyw.\",V9,0))","v":1},{"$nulls":4},20,4,{"$f":"IF(J9=\"nawiew\",AD9,IF(J9=\"naw.wyw.\",S9,0))","v":0},{"$f":"IF(J9=\"wywiew\",AD9,IF(J9=\"naw.wyw.\",S9,0))","v":4},2,0,2,{"$nulls":4},{"$f":"$AN$7","v":35},3,{"$f":"IF(J9=\"nawiew\",AO9,IF(J9=\"naw.wyw.\",AO9,0))","v":0},{"$f":"IF(J9=\"wywiew\",AO9,IF(J9=\"naw.wyw.\",AO9,0))","v":3},{"$f":"ROUNDUP(AO9/2,0)","v":2},{"$f":"IF(J9=\"nawiew\",AR9,IF(J9=\"naw.wyw.\",AR9,0))","v":0},{"$f":"IF(J9=\"wywiew\",AR9,IF(J9=\"naw.wyw.\",AR9,0))","v":2},{"$nulls":4},{"$f":"$AY$7","v":50},2,0,2,{"$f":"ROUNDUP(AZ9/1,0)","v":2},0,2]
[null,{"$f":"Dane!C44","v":"0.3"},"wywiew",{"$f":"Dane!E44","v":"Kuchnia otwarta z kuchenką elektryczną"},{"$f":"IF(Dane!E45=\"\",\"\",Dane!E45)","v":"04. Kuchnia"},{"$f":"Dane!G46","v":2},{"$f":"IF(D10<>0,Dane!J45,0)","v":15.52},{"$f":"Dane!L45","v":2.8},{"v":43.455999999999996,"d":"43"},"wywiew",50,{"v":43.455999999999996,"d":"43"},{"$f":"IF(D10<>0,Dane!S45,0)","v":75},0,{"v":0,"d":"0.00"},75,{"v":1.7258836524300443,"d":"1.73"},25,3,0,3,1,0,1,{"$nulls":4},20,4,0,4,2,0,2,{"$nulls":4},35,3,0,3,2,0,2,{"$nulls":4},50,2,0,2,2,0,2]
[null,{"$f":"Dane!C50","v":"0.4"},"nawiew",{"$f":"Dane!E50","v":"Jadalnia - nawiew"},{"$f":"IF(Dane!E51=\"\",\"\",Dane!E51)","v":"0.5 Jadalnia"},{"$f":"Dane!G52","v":2},{"$f":"IF(D11<>0,Dane!J51,0)","v":21.37},{"$f":"Dane!L51","v":4},{"v":85.48,"d":"85"},"nawiew",40,{"v":85.48,"d":"85"},{"$f":"IF(D11<>0,Dane!S51,0)","v":80},80,{"v":0.9358914365933552,"d":"0.94"},0,{"v":0,"d":"0.00"},25,4,4,0,2,2,0,{"$nulls":4},20,4,4,0,2,2,0,{"$nulls":4},35,3,3,0,2,2,0,{"$nulls":4},50,2,2,0,2,2,0]
[null,{"$f":"Dane!C56","v":"0.5"},"nawiew",{"$f":"Dane!E56","v":"Salon"},{"$f":"IF(Dane!E57=\"\",\"\",Dane!E57)","v":"0.6 Salon"},{"$f":"Dane!G58","v":4},{"$f":"IF(D12<>0,Dane!J57,0)","v":32.09},{"$f":"Dane!L57","v":4},{"v":128.36,"d":"128"},"nawiew",80,{"v":128.36,"d":"128"},{"$f":"IF(D12<>0,Dane!S57,0)","v":120},120,{"v":0.9348706762231224,"d":"0.93"},0,{"v":0,"d":"0.00"},25,5,5,0,2,2,0,{"$nulls":4},20,6,6,0,2,2,0,{"$nulls":4},35,4,4,0,2,2,0,{"$nulls":4},50,3,3,0,3,3,0]
[null,{"$f":"Dane!C62","v":"0.6"},"wywiew",{"$f":"Dane!E62","v":"Spiżarnia"},{"$f":"IF(Dane!E63=\"\",\"\",Dane!E63)","v":"04.a Spiżarnia"},{"$f":"Dane!G64","v":1},{"$f":"IF(D13<>0,Dane!J63,0)","v":4.23},{"$f":"Dane!L63","v":2.8},{"v":11.844000000000001,"d":"12"},"wywiew",15,{"v":11.844000000000001,"d":"12"},{"$f":"IF(D13<>0,Dane!S63,0)","v":25},0,{"v":0,"d":"0.00"},25,{"v":2.110773387369132,"d":"2.11"},25,1,0,1,1,0,1,{"$nulls":4},20,2,0,2,1,0,1,{"$nulls":4},35,1,0,1,1,0,1,{"$nulls":4},50,1,0,1,1,0,1]
[null,{"$f":"Dane!C68","v":"0.7"},"n.d.",{"$f":"Dane!E68","v":0},{"$f":"IF(Dane!E69=\"\",\"\",Dane!E69)","v":""},{"$f":"Dane!G70","v":0},{"$f":"IF(D14<>0,Dane!J69,0)","v":0},{"$f":"Dane!L69","v":2.7},0,"n.d.",0,0,{"$f":"IF(D14<>0,Dane!S69,0)","v":0},0,{"v":0,"d":"0.00"},0,{"v":0,"d":"0.00"},25,0,0,0,0,0,0,{"$nulls":4},20,0,0,0,0,0,0,{"$nulls":4},35,0,0,0,0,0,0,{"$nulls":4},50,0,0,0,0,0,0]
[null,{"$f":"Dane!C74","v":"0.8"},"n.d.",{"$f":"Dane!E74","v":0},{"$f":"IF(Dane!E75=\"\",\"\",Dane!E75)","v":""},{"$f":"Dane!G76","v":0},{"$f":"IF(D15<>0,Dane!J75,0)","v":0},{"$f":"Dane!L75","v":2.7},0,"n.d.",0,0,{"$f":"IF(D15<>0,Dane!S75,0)","v":0},0,{"v":0,"d":"0.00"},0,{"v":0,"d":"0.00"},25,0,0,0,0,0,0,{"$nulls":4},20,0,0,0,0,0,0,{"$nulls":4},35,0,0,0,0,0,0,{"$nulls":4},50,0,0,0,0,0,0]
[null,{"$f":"Dane!C80","v":"0.9"},"n.d.",{"$f":"Dane!E80","v":0},{"$f":"IF(Dane!E81=\"\",\"\",Dane!E81)","v":""},{"$f":"Dane!G82","v":0},{"$f":"IF(D16<>0,Dane!J81,0)","v":0},{"$f":"Dane!L81","v":2.7},0,"n.d.",0,0,{"$f":"IF(D16<>0,Dane!S81,0)","v":0},0,{"v":0,"d":"0.00"},0,{"v":0,"d":"0.00"},25,0,0,0,0,0,0,{"$nulls":4},20,0,0,0,0,0,0,{"$nulls":4},35,0,0,0,0,0,0,{"$nulls":4},50,0,0,0,0,0,0]
[null,{"$f":"Dane!C86","v":"0.10"},"n.d.",{"$f":"Dane!E86","v":0},{"$f":"IF(Dane!E87=\"\",\"\",Dane!E87)","v":""},{"$f":"Dane!G88","v":0},{"$f":"IF(D17<>0,Dane!J87,0)","v":0},{"$f":"Dane!L87","v":2.7},0,"n.d.",0,0,{"$f":"IF(D17<>0,Dane!S87,0)","v":0},0,{"v":0,"d":"0.00"},0,{"v":0,"d":"0.00"},25,0,0,0,0,0,0,{"$nulls":4},20,0,0,0,0,0,0,{"$nulls":4},35,0,0,0,0,0,0,{"$nulls":4},50,0,0,0,0,0,0]
[null,{"$f":"Dane!C92","v":"0.11"},"n.d.",{"$f":"Dane!E92","v":0},{"$f":"IF(Dane!E93=\"\",\"\",Dane!E93)","v":""},{"$f":"Dane!G94","v":0},{"$f":"IF(D18<>0,Dane!J93,0)","v":0},{"$f":"Dane!L93","v":2.7},0,{"$f":"IF(D18=0,\"n.d.\",VLOOKUP(D18,lista_pod_rodzaj_ruchu_powietrza,4,0))","v":"n.d."},{"$f":"IF(J18=\"n.d.\",0,IF(J18=\"nawiew\",F18*20,VLOOKUP(D18,warunki2,3,0)))","v":0},{"$f":"I18","v":0},{"$f":"IF(D18<>0,Dane!S93,0)","v":0},0,{"v":0,"d":"0.00"},0,{"v":0,"d":"0.00"},25,0,0,0,0,{"$f":"IF(J18=\"nawiew\",V18,IF(J18=\"naw.wyw.\",V18,0))","v":0},{"$f":"IF(J18=\"wywiew\",V18,IF(J18=\"naw.wyw.\",V18,0))","v":0},{"$nulls":4},20,0,0,0,0,0,0,{"$nulls":4},35,0,0,0,0,0,0,{"$nulls":4},50,0,0,0,0,0,0]
[null,{"$f":"Dane!C98","v":"0.12"},"n.d.",{"$f":"Dane!E98","v":0},{"$f":"IF(Dane!E99=\"\",\"\",Dane!E99)","v":""},{"$f":"Dane!G100","v":0},{"$f":"IF(D19<>0,Dane!J99,0)","v":0},{"$f":"Dane!L99","v":2.7},0,{"$f":"IF(D19=0,\"n.d.\",VLOOKUP(D19,lista_pod_rodzaj_ruchu_powietrza,4,0))","v":"n.d."},{"$f":"IF(J19=\"n.d.\",0,IF(J19=\"nawiew\",F19*20,VLOOKUP(D19,warunki2,3,0)))","v":0},{"$f":"I19","v":0},{"$f":"IF(D19<>0,Dane!S99,0)","v":0},0,{"v":0,"d":"0.00"},0,{"v":0,"d":"0.00"},25,0,0,0,0,{"$f":"IF(J19=\"nawiew\",V19,IF(J19=\"naw.wyw.\",V19,0))","v":0},{"$f":"IF(J19=\"wywiew\",V19,IF(J19=\"naw.wyw.\",V19,0))","v":0},{"$nulls":4},20,0,0,0,0,0,0,{"$nulls":4},35,0,0,0,0,0,0,{"$nulls":4},50,0,0,0,0,0,0]
[null,0,"n.d.",{"$f":"COUNTIFS(D8:D19,\"<>0\")","v":6},null,{"$f":"MAX(F8:F17)","v":4},{"$f":"SUM(G8:G19)","v":84.83000000000001},null,{"$f":"SUM(I8:I19)","v":{"v":301.676,"d":"302"}},{"$nulls":4},{"$f":"SUM(N8:N19)","v":200},null,{"$f":"SUM(P8:P19)","v":200}]
[null,{"$f":"Dane!C121","v":"1.1"},"n.d.",{"$f":"Dane!E121","v":"00:00:00"},{"$f":"IF(Dane!E122=\"\",\"\",Dane!E122)","v":""},{"$f":"Dane!G123","v":0},{"$f":"IF(D21<>0,Dane!J122,0)","v":0},{"$f":"Dane!L122","v":2.7},0,{"$f":"Dane!R121","v":"n.d."},{"$f":"Dane!Q122","v":0},{"$f":"Dane!Q123","v":0},{"$f":"IF(D21<>0,Dane!S122,0)","v":0},0,{"v":0,"d":"0.00"},0,{"v":0,"d":"0.00"},{"$f":"$R$7","v":25},0,0,{"$f":"IF(J21=\"wywiew\",S21,IF(J21=\"naw.wyw.\",S21,0))","v":0},0,{"$f":"IF(J21=\"nawiew\",V21,IF(J21=\"naw.wyw.\",V21,0))","v":0},{"$f":"IF(J21=\"wywiew\",V21,IF(J21=\"naw.wyw.\",V21,0))","v":0},{"$nulls":4},20,{"$f":"ROUNDUP(M21/AC21,0)","v":0},0,0,{"$f":"ROUNDUP(AD21/3,0)","v":0},{"$f":"IF(J21=\"nawiew\",AG21,IF(J21=\"naw.wyw.\",AG21,0))","v":0},{"$f":"IF(J21=\"wywiew\",AG21,IF(J21=\"naw.wyw.\",AG21,0))","v":0},{"$nulls":4},{"$f":"$AN$7","v":35},{"$f":"ROUNDUP(M21/AN21,0)","v":0},0,0,0,0,0,{"$nulls":4},{"$f":"$AY$7","v":50},{"$f":"ROUNDUP(M21/AY21,0)","v":0},{"$f":"IF(J21=\"nawiew\",AZ21,IF(J21=\"naw.wyw.\",AZ21,0))","v":0},{"$f":"IF(J21=\"wywiew\",AZ21,IF(J21=\"naw.wyw.\",AZ21,0))","v":0},0,{"$f":"IF(J21=\"nawiew\",BC21,IF(J21=\"naw.wyw.\",BC21,0))","v":0},{"$f":"IF(J21=\"wywiew\",BC21,IF(J21=\"naw.wyw.\",BC21,0))","v":0}]
[null,{"$f":"Dane!C126","v":"1.2"},"n.d.",{"$f":"Dane!E126","v":"00:00:00"},{"$f":"IF(Dane!E127=\"\",\"\",Dane!E127)","v":""},{"$f":"Dane!G128","v":0},{"$f":"IF(D22<>0,Dane!J127,0)","v":0},{"$f":"Dane!L127","v":2.5},0,{"$f":"Dane!R126","v":"n.d."},{"$f":"Dane!Q127","v":0},{"$f":"Dane!Q128","v":48},{"$f":"IF(D22<>0,Dane!S127,0)","v":0},0,{"v":0,"d":"0.00"},0,{"v":0,"d":"0.00"},25,0,0,0,{"$f":"ROUNDUP(S22/3,0)","v":0},0,0,{"$nulls":4},20,0,0,0,0,0,0,{"$nulls":4},35,0,0,0,0,0,0,{"$nulls":4},50,0,0,0,0,0,0]
[null,{"$f":"Dane!C132","v":"1.3"},"n.d.",{"$f":"Dane!E132","v":"00:00:00"},{"$f":"IF(Dane!E133=\"\",\"\",Dane!E133)","v":""},{"$f":"Dane!G134","v":0},{"$f":"IF(D23<>0,Dane!J133,0)","v":0},{"$f":"Dane!L133","v":2.5},0,{"$f":"Dane!R132","v":"n.d."},{"$f":"Dane!Q133","v":0},{"$f":"Dane!Q134","v":{"v":10.9,"d":"11"}},{"$f":"IF(D23<>0,Dane!S133,0)","v":0},0,{"v":0,"d":"0.00"},0,{"v":0,"d":"0.00"},25,0,0,0,{"$f":"ROUNDUP(S23/3,0)","v":0},0,0,{"$nulls":4},20,0,0,0,0,0,0,{"$nulls":4},35,0,0,0,0,0,0,{"$nulls":4},50,0,0,0,0,0,0]
[null,{"$f":"Dane!C138","v":"1.4"},"n.d.",{"$f":"Dane!E138","v":"00:00:00"},{"$f":"IF(Dane!E139=\"\",\"\",Dane!E139)","v":""},{"$f":"Dane!G140","v":0},{"$f":"IF(D24<>0,Dane!J139,0)","v":0},{"$f":"Dane!L139","v":2.5},0,{"$f":"Dane!R138","v":"n.d."},{"$f":"Dane!Q139","v":0},{"$f":"Dane!Q140","v":{"v":39.05,"d":"39"}},{"$f":"IF(D24<>0,Dane!S139,0)","v":0},0,{"v":0,"d":"0.00"},0,{"v":0,"d":"0.00"},25,0,0,0,{"$f":"ROUNDUP(S24/3,0)","v":0},0,0,{"$nulls":4},20,0,0,0,0,0,0,{"$nulls":4},35,0,0,0,0,0,0,{"$nulls":4},50,0,0,0,0,0,0]
[null,{"$f":"Dane!C144","v":"1.5"},"n.d.",{"$f":"Dane!E144","v":"00:00:00"},{"$f":"IF(Dane!E145=\"\",\"\",Dane!E145)","v":"19. Pokój"},{"$f":"Dane!G146","v":0},{"$f":"IF(D25<>0,Dane!J145,0)","v":0},{"$f":"Dane!L145","v":2.5},0,{"$f":"Dane!R144","v":"n.d."},{"$f":"Dane!Q145","v":0},{"$f":"Dane!Q146","v":{"v":68.05,"d":"68"}},{"$f":"IF(D25<>0,Dane!S145,0)","v":0},0,{"v":0,"d":"0.00"},0,{"v":0,"d":"0.00"},25,0,0,0,{"$f":"ROUNDUP(S25/3,0)","v":0},0,0,{"$nulls":4},20,0,0,0,0,0,0,{"$nulls":4},35,0,0,0,0,0,0,{"$nulls":4},50,0,0,0,0,0,0]
[null,{"$f":"Dane!C150","v":"1.6"},"n.d.",{"$f":"Dane!E150","v":"00:00:00"},{"$f":"IF(Dane!E151=\"\",\"\",Dane!E151)","v":"Nazwa pomieszczenia"},{"$f":"Dane!G152","v":0},{"$f":"IF(D26<>0,Dane!J151,0)","v":0},{"$f":"Dane!L151","v":2.7},0,{"$f":"Dane!R150","v":"n.d."},{"$f":"Dane!Q151","v":0},{"$f":"Dane!Q152","v":0},{"$f":"IF(D26<>0,Dane!S151,0)","v":0},0,{"v":0,"d":"0.00"},0,{"v":0,"d":"0.00"},25,0,0,0,{"$f":"ROUNDUP(S26/3,0)","v":0},0,0,{"$nulls":4},20,0,0,0,0,0,0,{"$nulls":4},35,0,0,0,0,0,0,{"$nulls":4},50,0,0,0,0,0,0]
[null,{"$f":"Dane!C156","v":"1.7"},"n.d.",{"$f":"Dane!E156","v":"00:00:00"},{"$f":"IF(Dane!E157=\"\",\"\",Dane!E157)","v":"Nazwa pomieszczenia"},{"$f":"Dane!G158","v":0},{"$f":"IF(D27<>0,Dane!J157,0)","v":0},{"$f":"Dane!L157","v":2.75},0,{"$f":"Dane!R156","v":"n.d."},{"$f":"Dane!Q157","v":0},{"$f":"Dane!Q158","v":0},{"$f":"IF(D27<>0,Dane!S157,0)","v":0},0,{"v":0,"d":"0.00"},0,{"v":0,"d":"0.00"},25,0,0,0,{"$f":"ROUNDUP(S27/3,0)","v":0},0,0,{"$nulls":4},20,0,0,0,0,0,0,{"$nulls":4},35,0,0,0,0,0,0,{"$nulls":4},50,0,0,0,0,0,0]
[null,{"$f":"Dane!C162","v":"1.8"},"n.d.",{"$f":"Dane!E162","v":"00:00:00"},{"$f":"IF(Dane!E163=\"\",\"\",Dane!E163)","v":"Nazwa pomieszczenia"},{"$f":"Dane!G164","v":0},{"$f":"IF(D28<>0,Dane!J163,0)","v":0},{"$f":"Dane!L163","v":2.7},0,{"$f":"Dane!R162","v":"n.d."},{"$f":"Dane!Q163","v":0},{"$f":"Dane!Q164","v":0},{"$f":"IF(D28<>0,Dane!S163,0)","v":0},0,{"v":0,"d":"0.00"},0,{"v":0,"d":"0.00"},25,0,0,0,{"$f":"ROUNDUP(S28/3,0)","v":0},0,0,{"$nulls":4},20,0,0,0,0,0,0,{"$nulls":4},35,0,0,0,0,0,0,{"$nulls":4},50,0,0,0,0,0,0]
[{"$nulls":3},{"$f":"COUNTIFS(D17:D28,\"<>0\")","v":1},null,{"$f":"MAX(F21:F28)","v":0},{"$f":"SUM(G21:G28)","v":0},null,{"$f":"SUM(I21:I28)","v":0},{"$nulls":4},{"$f":"SUM(N21:N28)","v":0},null,{"$f":"SUM(P21:P28)","v":0},{"$nulls":8},{"$f":"IF(T30<13,1,\"więcej\")","v":1},{"$f":"IF(T30<19,1,\"więcej\")","v":1},{"$f":"IF(U30<13,1,\"więcej\")","v":1},{"$f":"IF(U30<19,1,\"więcej\")","v":1},{"$nulls":7},{"$f":"ROUNDUP(AE30/12,0)","v":1},{"$f":"ROUNDUP(AE30/18,0)","v":1},{"$f":"ROUNDUP(AF30/12,0)","v":1},{"$f":"ROUNDUP(AF30/18,0)","v":1},{"$nulls":18},{"$f":"ROUNDUP(BA30/6,0)","v":1},{"$f":"ROUNDUP(BA30/10,0)","v":1},{"$f":"ROUNDUP(BB30/6,0)","v":1},{"$f":"ROUNDUP(BB30/10,0)","v":1}]
[{"$nulls":6},{"$f":"G20+G29","v":{"v":84.83000000000001,"d":"85"}},null,{"$f":"I20+I29","v":{"v":301.676,"d":"302"}},{"$nulls":4},{"$f":"N20+N29","v":200},null,{"$f":"P20+P29","v":200},null,null,{"$f":"SUM(S8:S29)","v":17},{"$f":"SUM($T$8:$T$29)","v":9},{"$f":"SUM($U$8:$U$29)","v":8},{"$f":"W30+X30","v":8},{"$f":"SUM(W8:W29)","v":4},{"$f":"SUM(X8:X29)","v":4},{"$f":"IF(Y29=\"więcej\",1,Y29)","v":1},{"$f":"IF(Z29=\"więcej\",1,Z29)","v":1},{"$f":"IF(AA29=\"więcej\",1,AA29)","v":1},{"$f":"IF(AB29=\"więcej\",1,AB29)","v":1},null,{"$f":"SUM(AD8:AD29)","v":22},{"$f":"SUM(AE8:AE29)","v":10},{"$f":"SUM(AF8:AF29)","v":12},{"$f":"AH30+AI30","v":10},{"$f":"SUM(AH8:AH29)","v":4},{"$f":"SUM(AI8:AI29)","v":6},{"$f":"IF(AJ29=1,\"12x63\",\"18x63\")","v":"12x63"},null,{"$f":"IF(AL29=1,\"12x63\",\"18x63\")","v":"12x63"},null,null,{"$f":"SUM(AO8:AO29)","v":15},{"$f":"SUM(AP8:AP29)","v":7},{"$f":"SUM(AQ8:AQ29)","v":8},{"$f":"AS30+AT30","v":10},{"$f":"SUM(AS8:AS29)","v":4},{"$f":"SUM(AT8:AT29)","v":6},{"$f":"IF(AP30<5,\"XS 4x75\",IF(AP30<7,\"S 6x75\",IF(AP30<9,\"M 8x75\",IF(AP30<11,\"L 10x75\",IF(AP30<13,\"XL 12x75\",\"więcej\")))))","v":"M 8x75"},null,{"$f":"IF(AQ30<5,\"XS 4x75\",IF(AQ30<7,\"S 6x75\",IF(AQ30<9,\"M 8x75\",IF(AQ30<11,\"L 10x75\",IF(AQ30<13,\"XL 12x75\",\"więcej\")))))","v":"M 8x75"},null,null,{"$f":"SUM(AZ8:AZ29)","v":11},{"$f":"SUM(BA8:BA29)","v":5},{"$f":"SUM(BB8:BB29)","v":6},{"$f":"BD30+BE30","v":11},{"$f":"SUM(BD8:BD29)","v":5},{"$f":"SUM(BE8:BE29)","v":6},{"$f":"IF(BA30<5,\"XS 4x75\",IF(BA30<7,\"S 6x75\",IF(BA30<9,\"M 8x75\",IF(BA30<11,\"L 10x75\",IF(BA30<13,\"XL 12x75\",\"więcej\")))))","v":"S 6x75"},null,{"$f":"IF(BB30<5,\"XS 4x75\",IF(BB30<7,\"S 6x75\",IF(BB30<9,\"M 8x75\",IF(BB30<11,\"L 10x75\",IF(BB30<13,\"XL 12x75\",\"więcej\")))))","v":"S 6x75"}]
[{"$nulls":6},"[m2]",null,"[m3]",{"$nulls":4},{"$f":"N7","v":"[m3/h]"},null,{"$f":"P7","v":"[m3/h]"},{"$nulls":8},{"$f":"IF((T30-12)<13,IF((T30-12)>0,1,0),\"więcej\")","v":0},{"$f":"IF((T30-18)<13,0,IF((T30-18)<19,1,\"więcej\"))","v":0},{"$f":"IF((U30-12)<13,IF((V30-12)>0,1,0),\"więcej\")","v":0},{"$f":"IF((U30-18)<13,0,IF((U30-18)<19,1,\"więcej\"))","v":0},{"$nulls":18},{"$f":"IF(AP30<5,AU38,IF(AP30<7,AU39,IF(AP30<9,AU40,IF(AP30<11,AU41,IF(AP30<13,AU42,AU42)))))","v":"Skrzynka rozdzielacza M"},{"$f":"IF(AU31=AU38,\"XS 4x75\",IF(AU31=AU39,\"S 6x75\",IF(AU31=AU40,\"M 8x75\",IF(AU31=AU41,\"L 10x75\",IF(AU31=AU42,\"XL 12x75\",\"\")))))","v":"M 8x75"},{"$f":"IF(AQ30<5,AU38,IF(AQ30<7,AU39,IF(AQ30<9,AU40,IF(AQ30<11,AU41,IF(AQ30<13,AU42,AU42)))))","v":"Skrzynka rozdzielacza M"},{"$f":"IF(AW31=AU38,\"XS 4x75\",IF(AW31=AU39,\"S 6x75\",IF(AW31=AU40,\"M 8x75\",IF(AW31=AU41,\"L 10x75\",IF(AW31=AU42,\"XL 12x75\",\"\")))))","v":"M 8x75"},{"$nulls":7},{"$f":"IF(BA30<5,BF38,IF(BA30<7,BF39,IF(BA30<9,BF40,IF(BA30<11,BF41,IF(BA30<13,BF42,BF42)))))","v":"Skrzynka rozdzielacza S"},{"$f":"IF(BF31=BF38,\"XS 4x75\",IF(BF31=BF39,\"S 6x75\",IF(BF31=BF40,\"M 8x75\",IF(BF31=BF41,\"L 10x75\",IF(BF31=BF42,\"XL 12x75\",\"\")))))","v":"S 6x75"},{"$f":"IF(BB30<5,BF38,IF(BB30<7,BF39,IF(BB30<9,BF40,IF(BB30<11,BF41,IF(BB30<13,BF42,BF42)))))","v":"Skrzynka rozdzielacza S"},{"$f":"IF(BH31=BF38,\"XS 4x75\",IF(BH31=BF39,\"S 6x75\",IF(BH31=BF40,\"M 8x75\",IF(BH31=BF41,\"L 10x75\",IF(BH31=BF42,\"XL 12x75\",\"\")))))","v":"S 6x75"}]
[{"$nulls":19},{"$f":"SUM($T$8:$T$29)","v":9},{"$f":"SUM($U$8:$U$29)","v":8},{"$nulls":25},{"$f":"IF(AP30<5,AV38,IF(AP30<7,AV39,IF(AP30<9,AV40,IF(AP30<11,AV41,IF(AP30<13,AV42,AV42)))))","v":"Płyta przyłączeniowa M 8 kanałów DN75"},{"$f":"IF(AU32=AV38,\"XS 4x75\",IF(AU32=AV39,\"S 6x75\",IF(AU32=AV40,\"M 8x75\",IF(AU32=AV41,\"L 10x75\",IF(AU32=AV42,\"XL 12x75\",\"\")))))","v":"M 8x75"},{"$f":"IF(AQ30<5,AV38,IF(AQ30<7,AV39,IF(AQ30<9,AV40,IF(AQ30<11,AV41,IF(AQ30<13,AV42,AV42)))))","v":"Płyta przyłączeniowa M 8 kanałów DN75"},{"$f":"IF(AW32=AV38,\"XS 4x75\",IF(AW32=AV39,\"S 6x75\",IF(AW32=AV40,\"M 8x75\",IF(AW32=AV41,\"L 10x75\",IF(AW32=AV42,\"XL 12x75\",\"\")))))","v":"M 8x75"},{"$nulls":7},{"$f":"IF(BA30<5,BG38,IF(BA30<7,BG39,IF(BA30<9,BG40,IF(BA30<11,BG41,IF(BA30<13,BG42,BG42)))))","v":"Płyta przyłączeniowa S 6 kanały DN75"},{"$f":"IF(BF32=BG38,\"XS 4x75\",IF(BF32=BG39,\"S 6x75\",IF(BF32=BG40,\"M 8x75\",IF(BF32=BG41,\"L 10x75\",IF(BF32=BG42,\"XL 12x75\",\"\")))))","v":"S 6x75"},{"$f":"IF(BB30<5,BG38,IF(BB30<7,BG39,IF(BB30<9,BG40,IF(BB30<11,BG41,IF(BB30<13,BG42,BG42)))))","v":"Płyta przyłączeniowa S 6 kanały DN75"},{"$f":"IF(BH32=BG38,\"XS 4x75\",IF(BH32=BG39,\"S 6x75\",IF(BH32=BG40,\"M 8x75\",IF(BH32=BG41,\"L 10x75\",IF(BH32=BG42,\"XL 12x75\",\"\")))))","v":"S 6x75"}]
[{"$nulls":22},"12x63=",null,{"$f":"IF(Y29=\"więcej\",IF(T30<19,0,IF(T30<25,Y30+Y31,IF(T30-18<13,1,0))),IF(T30<13,Y29))","v":1},null,{"$f":"IF(AA29=\"więcej\",IF(U30<19,0,IF(U30<25,AA30+AA31,IF(U30-18<13,1,0))),IF(U30<13,AA29))","v":1},{"$nulls":19},{"$f":"IF(AP30>12,AP30-12,0)","v":0},1,{"$f":"IF(AQ30>12,AQ30-12,0)","v":0},1,{"$nulls":7},{"$f":"IF(BA30>12,BA30-12,0)","v":0},1,{"$f":"IF(BB30>12,BB30-12,0)","v":0},1]
[{"$nulls":13},{"$f":"IFERROR(IF(P30/N30<=1,IF(P30/N30>0.95,1,0),0),0)","v":1},{"$nulls":8},"18x63=",null,null,{"$f":"IF(Y29=1,0,IF(Y33=2,0,IF(T30<25,Z30+Z31,Z30+Z31)))","v":0},null,{"$f":"IF(AA29=1,0,IF(AA33=2,0,IF(U30<25,AB30+AB31,AB30+AB31)))","v":0},{"$nulls":18},{"$f":"IF(AU33=0,\"\",IF(AU33<5,AU38,IF(AU33<7,AU39,IF(AU33<9,AU40,IF(AU33<11,AU41,IF(AU33<13,AU42,\"więcej\"))))))","v":""},{"$f":"IF(AU34=AU38,\"XS 4x75\",IF(AU34=AU39,\"S 6x75\",IF(AU34=AU40,\"M 8x75\",IF(AU34=AU41,\"L 10x75\",IF(AU34=AU42,\"XL 12x75\",\"\")))))","v":""},{"$f":"IF(AW33=0,\"\",IF(AW33<5,AU38,IF(AW33<7,AU39,IF(AW33<9,AU40,IF(AW33<11,AU41,IF(AW33<13,AU42,\"więcej\"))))))","v":""},{"$f":"IF(AW34=AU38,\"XS 4x75\",IF(AW34=AU39,\"S 6x75\",IF(AW34=AU40,\"M 8x75\",IF(AW34=AU41,\"L 10x75\",IF(AW34=AU42,\"XL 12x75\",\"\")))))","v":""},{"$nulls":7},{"$f":"IF(BF33=0,\"\",IF(BF33<5,BF38,IF(BF33<7,BF39,IF(BF33<9,BF40,IF(BF33<11,BF41,IF(BF33<13,BF42,\"więcej\"))))))","v":""},{"$f":"IF(BF34=BF38,\"XS 4x75\",IF(BF34=BF39,\"S 6x75\",IF(BF34=BF40,\"M 8x75\",IF(BF34=BF41,\"L 10x75\",IF(BF34=BF42,\"XL 12x75\",\"\")))))","v":""},{"$f":"IF(BH33=0,\"\",IF(BH33<5,BF38,IF(BH33<7,BF39,IF(BH33<9,BF40,IF(BH33<11,BF41,IF(BH33<13,BF42,\"więcej\"))))))","v":""},{"$f":"IF(BH34=BF38,\"XS 4x75\",IF(BH34=BF39,\"S 6x75\",IF(BH34=BF40,\"M 8x75\",IF(BH34=BF41,\"L 10x75\",IF(BH34=BF42,\"XL 12x75\",\"\")))))","v":""}]
[{"$nulls":9},1,2,3,4,5,6,7,8,9,10,11,12,13,14,15,16,17,18,19,20,21,22,{"$nulls":15},{"$f":"IF(AU33=0,\"\",IF(AU33<5,AV38,IF(AU33<7,AV39,IF(AU33<9,AV40,IF(AU33<11,AV41,IF(AU33<13,AV42,\"więcej\"))))))","v":""},{"$f":"IF(AU35=AV38,\"XS 4x75\",IF(AU35=AV39,\"S 6x75\",IF(AU35=AV40,\"M 8x75\",IF(AU35=AV41,\"L 10x75\",IF(AU35=AV42,\"XL 12x75\",\"\")))))","v":""},{"$f":"IF(AW33=0,\"\",IF(AW33<5,AV38,IF(AW33<7,AV39,IF(AW33<9,AV40,IF(AW33<11,AV41,IF(AW33<13,AV42,\"więcej\"))))))","v":""},{"$f":"IF(AW35=AV38,\"XS 4x75\",IF(AW35=AV39,\"S 6x75\",IF(AW35=AV40,\"M 8x75\",IF(AW35=AV41,\"L 10x75\",IF(AW35=AV42,\"XL 12x75\",\"\")))))","v":""},{"$nulls":7},{"$f":"IF(BF33=0,\"\",IF(BF33<5,BG38,IF(BF33<7,BG39,IF(BF33<9,BG40,IF(BF33<11,BG41,IF(BF33<13,BG42,\"więcej\"))))))","v":""},{"$f":"IF(BF35=BG38,\"XS 4x75\",IF(BF35=BG39,\"S 6x75\",IF(BF35=BG40,\"M 8x75\",IF(BF35=BG41,\"L 10x75\",IF(BF35=BG42,\"XL 12x75\",\"\")))))","v":""},{"$f":"IF(BH33=0,\"\",IF(BH33<5,BG38,IF(BH33<7,BG39,IF(BH33<9,BG40,IF(BH33<11,BG41,IF(BH33<13,BG42,\"więcej\"))))))","v":""},{"$f":"IF(BH35=BG38,\"XS 4x75\",IF(BH35=BG39,\"S 6x75\",IF(BH35=BG40,\"M 8x75\",IF(BH35=BG41,\"L 10x75\",IF(BH35=BG42,\"XL 12x75\",\"\")))))","v":""}]
[null,"Lista N","Nr","Nazwa","Sortowanie_nawiew",{"$nulls":4},"Dobór centrali",null,null,"wydajność",null,"Moc akustyczna","opór","spr. Ciepło","spr. Wilgoć","Wymiary DxWxS","Rodzaj wymiennika","Odpływ kondensatu","Klapa bypas","Nagrzewnica elektryczna","Sterowanie ręczne","Sterowanie czasowe","Sterowanie centralne wg zapotrzebowania","Sterowanie lokalne według zapotrzebowania","Sterowanie","Sterowanie 2","Komunikacja","Króćce",{"$nulls":15},{"$f":"IF(AU33>0,AU33,0)","v":0},{"$f":"IF(AU36=0,0,1)","v":0},{"$f":"IF(AW33>0,AW33,0)","v":0},{"$f":"IF(AW36=0,0,1)","v":0},{"$nulls":7},{"$f":"IF(BF33>0,BF33,0)","v":0},{"$f":"IF(BF36=0,0,1)","v":0},{"$f":"IF(BH33>0,BH33,0)","v":0},{"$f":"IF(BH36=0,0,1)","v":0}]
[null,{"$f":"IF(C8=\"nawiew\",D8,IF(C8=\"naw.wyw.\",D8,\"\"))","v":""},{"$f":"IF(C8=\"nawiew\",B8,IF(C8=\"naw.wyw.\",B8,\"10\"))","v":"10"},{"$f":"IF(C8=\"nawiew\",E8,IF(C8=\"naw.wyw.\",E8,\"\"))","v":""},{"$f":"_xlfn.SORTBY(C37:C56,listaN,-1)","v":"0.5"},{"$nulls":4},{"$f":"'Elementy DN63'!D3","v":"Vitovent 300-W 325m3/h lewa"},null,null,325,{"$f":"IF($N$30<M37*0.93,1,0)","v":1},41,250,91,"n.d.","560 x 695 x 750","Krzyżowy","Tak","Tak","Tak, 1kW","-","A","A+","A+",{"$f":"J70","v":"Moduł obsługowy ścienny LB1"},null,{"$f":"J71","v":"Przewód połączeniowy Vitocal (WO1C)"},160,{"$nulls":8},"Rozdzielacz"]
[null,"","10","","0.4",{"$nulls":4},{"$f":"'Elementy DN63'!D4","v":"Vitovent 300-W 325m3/h prawa"},null,null,325,{"$f":"IF($N$30<M38*0.93,1,0)","v":1},41,250,91,"n.d.","560 x 695 x 750","Krzyżowy","Tak","Tak","Tak, 1kW","-","A","A+","A+",{"$f":"J70","v":"Moduł obsługowy ścienny LB1"},null,{"$f":"J71","v":"Przewód połączeniowy Vitocal (WO1C)"},160,{"$nulls":8},"XS",4,160,{"$nulls":4},{"$f":"'Elementy DN75&90'!D22","v":"Skrzynka rozdzielacza XS"},{"$f":"'Elementy DN75&90'!D27","v":"Płyta przyłączeniowa XS 4 kanały DN75"},{"$nulls":9},{"$f":"AU38","v":"Skrzynka rozdzielacza XS"},{"$f":"AV38","v":"Płyta przyłączeniowa XS 4 kanały DN75"}]
[null,"","10","","10",{"$nulls":4},{"$f":"'Elementy DN63'!D5","v":"Vitovent 300-W 400m3/h lewa"},null,null,400,1,50,250,92,"n.d.","560 x 695 x 750","Krzyżowy","Tak","Tak","Tak, 1kW","-","A","A+","A+",{"$f":"J70","v":"Moduł obsługowy ścienny LB1"},null,{"$f":"J71","v":"Przewód połączeniowy Vitocal (WO1C)"},180,{"$nulls":8},"S",6,240,{"$nulls":4},{"$f":"'Elementy DN75&90'!D23","v":"Skrzynka rozdzielacza S"},{"$f":"'Elementy DN75&90'!D28","v":"Płyta przyłączeniowa S 6 kanały DN75"},{"$nulls":9},{"$f":"AU39","v":"Skrzynka rozdzielacza S"},{"$f":"AV39","v":"Płyta przyłączeniowa S 6 kanały DN75"}]
[null,"Jadalnia - nawiew","0.4","0.5 Jadalnia","10",{"$nulls":4},{"$f":"'Elementy DN63'!D6","v":"Vitovent 300-W 400m3/h prawa"},null,null,400,1,50,250,92,"n.d.","560 x 695 x 750","Krzyżowy","Tak","Tak","Tak, 1kW","-","A","A+","A+",{"$f":"J70","v":"Moduł obsługowy ścienny LB1"},null,{"$f":"J71","v":"Przewód połączeniowy Vitocal (WO1C)"},180,{"$nulls":8},"M",8,320,{"$nulls":4},{"$f":"'Elementy DN75&90'!D24","v":"Skrzynka rozdzielacza M"},{"$f":"'Elementy DN75&90'!D29","v":"Płyta przyłączeniowa M 8 kanałów DN75"},{"$nulls":9},"Skrzynka rozdzielacza M","Płyta przyłączeniowa M 8 kanałów DN75"]
[null,"Salon","0.5","0.6 Salon","10",{"$nulls":4},{"$f":"'Elementy DN63'!D7","v":"Vitovent 300-W 225m3/h lewa"},null,null,225,1,39,250,92,"n.d.","455 x 650 x 600","Krzyżowy","Tak","Tak","Tak, 1kW","-","A","A+","A+",{"$f":"J70","v":"Moduł obsługowy ścienny LB1"},null,{"$f":"J71","v":"Przewód połączeniowy Vitocal (WO1C)"},125,{"$nulls":8},"L",10,400,{"$nulls":4},{"$f":"'Elementy DN75&90'!D25","v":"Skrzynka rozdzielacza L"},{"$f":"'Elementy DN75&90'!D30","v":"Płyta przyłączeniowa L 10 kanałów DN75"},{"$nulls":9},"Skrzynka rozdzielacza L","Płyta przyłączeniowa L 10 kanałów DN75"]
[null,"","10","","10",{"$nulls":4},{"$f":"'Elementy DN63'!D8","v":"Vitovent 300-W 225m3/h prawa"},null,null,225,1,39,250,92,"n.d.","455 x 650 x 600","Krzyżowy","Tak","Tak","Tak, 1kW","-","A","A+","A+",{"$f":"J70","v":"Moduł obsługowy ścienny LB1"},null,{"$f":"J71","v":"Przewód połączeniowy Vitocal (WO1C)"},125,{"$nulls":8},"XL",12,460,{"$nulls":4},{"$f":"'Elementy DN75&90'!D26","v":"Skrzynka rozdzielacza XL"},{"$f":"'Elementy DN75&90'!D31","v":"Płyta przyłączeniowa XL 12 kanałów DN75"},{"$nulls":9},"Skrzynka rozdzielacza XL","Płyta przyłączeniowa XL 12 kanałów DN75"]
[null,"","10","","10",{"$nulls":4},{"$f":"'Elementy DN63'!D9","v":"Vitovent 300-W 600m3/h lewa"},null,null,600,{"$f":"IF($N$30<M43*0.93,1,0)","v":1},49,250,92,"n.d.","660 x 800 x 850","Krzyżowy","Tak","Tak","Tak, 1kW","-","A","A","A+",{"$f":"J70","v":"Moduł obsługowy ścienny LB1"},null,{"$f":"J71","v":"Przewód połączeniowy Vitocal (WO1C)"},180]
[null,"","10","","10",{"$nulls":4},{"$f":"'Elementy DN63'!D10","v":"Vitovent 300-W 600m3/h prawa"},null,null,600,1,49,250,92,"n.d.","660 x 800 x 850","Krzyżowy","Tak","Tak","Tak, 1kW","-","A","A","A+",{"$f":"J70","v":"Moduł obsługowy ścienny LB1"},null,{"$f":"J71","v":"Przewód połączeniowy Vitocal (WO1C)"},180]
[null,"","10","","10",{"$nulls":4},{"$f":"'Elementy DN63'!D11","v":"Vitoair FS 300E MA 300m3/h"},null,null,300,{"$f":"IF($N$30<M45*0.93,1,0)","v":1},39,215,80,74,"1254 x 244 x 800","Krzyżowy, entalpiczny","Nie","Tak","Opcja 1,8kW","-","A","A","A",{"$f":"J68","v":"Vitotrol 300-E"},{"$f":"J69","v":"Przełącznik 4-stopniowy"},"Przewód komunikacyjny Can-Bus 5m",160]
[null,"","10","","10",{"$nulls":4},{"$f":"IF(N37=0,\"\",J37)","v":"Vitovent 300-W 325m3/h lewa"},{"$nulls":3},{"$f":"N37","v":1}]
[null,"","10","","10",{"$nulls":4},"Vitovent 300-W 325m3/h prawa",{"$nulls":3},{"$f":"N38","v":1},{"$nulls":10},{"$f":"IF(Y33>0,\"12x63\",IF(Y33=0,IF(Z34>1,\"18x63\",\"\")))","v":"12x63"},{"$f":"IF(Z33>0,\"12x63\",\"\")","v":""},{"$f":"IF(AA33>0,\"12x63\",IF(AA33=0,IF(AB34>1,\"18x63\",\"\")))","v":"12x63"}]
[null,"","10","","10",{"$nulls":4},"Vitovent 300-W 400m3/h lewa",{"$nulls":3},1,{"$nulls":10},{"$f":"IF(Y33>1,\"12x63\",IF(Z34>=1,\"18x63\",\"\"))","v":""},null,{"$f":"IF(AA33>1,\"12x63\",IF(AB34>=1,\"18x63\",\"\"))","v":""}]
[null,{"$f":"IF(C21=\"nawiew\",D21,IF(C21=\"naw.wyw.\",D21,\"\"))","v":""},{"$f":"IF(C21=\"nawiew\",B21,IF(C21=\"naw.wyw.\",B21,\"10\"))","v":"10"},"","10",{"$nulls":4},"Vitovent 300-W 400m3/h prawa",{"$nulls":3},1]
[null,"","10","","10",{"$nulls":4},"Vitovent 300-W 225m3/h lewa",{"$nulls":3},1]
[null,"","10","","10",{"$nulls":4},"Vitovent 300-W 225m3/h prawa",{"$nulls":3},1]
[null,"","10","","10",{"$nulls":4},"Vitovent 300-W 600m3/h lewa",{"$nulls":3},1]
[null,"","10","","10",{"$nulls":4},"Vitovent 300-W 600m3/h prawa",{"$nulls":3},1]
[null,"","10","","10",{"$nulls":4},{"$f":"IF(N45=0,\"\",J45)","v":"Vitoair FS 300E MA 300m3/h"},{"$nulls":3},{"$f":"N45","v":1}]
[null,"","10","","10"]
[null,"","10","","10",{"$nulls":4},{"$f":"_xlfn.SORTBY(J46:J54,N46:N54,-1)","v":"Vitovent 300-W 325m3/h lewa"},{"$nulls":3},"Wybor 63:",{"$nulls":10},"Wybor 75:",{"$nulls":14},"Wybor 90:"]
[{"$nulls":3},"",{"$nulls":5},"Vitovent 300-W 325m3/h prawa",{"$nulls":3},{"$f":"'System DN63'!X137","v":"Vitoair FS 300E MA 300m3/h"},{"$nulls":10},{"$f":"'System DN75'!X137","v":"Vitoair FS 300E MA 300m3/h"},{"$nulls":14},{"$f":"'System DN90'!X137","v":"Vitovent 300-W 400m3/h lewa"}]
[null,{"$f":"21-COUNTBLANK(listaN)","v":3},{"$nulls":7},"Vitovent 300-W 400m3/h lewa",{"$nulls":3},"Króćce 63",{"$nulls":10},"Króćce 75",{"$nulls":14},"Króćce 75"]
[{"$nulls":9},"Vitovent 300-W 400m3/h prawa",{"$nulls":3},{"$f":"VLOOKUP(N57,J37:AE45,22,0)","v":160},{"$nulls":10},{"$f":"VLOOKUP(Y57,J37:AE45,22,0)","v":160},{"$nulls":14},{"$f":"VLOOKUP(AN57,J37:AE45,22,0)","v":180}]
[null,"Lista W","Nr","Nazwa","Sortowanie_wywiew",{"$nulls":4},"Vitovent 300-W 225m3/h lewa"]
[null,{"$f":"IF(C8=\"wywiew\",D8,IF(C8=\"naw.wyw.\",D8,\"\"))","v":"Wiatrołap"},{"$f":"IF(C8=\"wywiew\",B8,IF(C8=\"naw.wyw.\",B8,\"10\"))","v":"0.1"},{"$f":"IF(C8=\"wywiew\",E8,IF(C8=\"naw.wyw.\",E8,\"\"))","v":"0.1 Wiatrołap"},{"$f":"_xlfn.SORTBY(C61:C80,B61:B80,-1)","v":"0.1"},{"$nulls":4},"Vitovent 300-W 225m3/h prawa"]
[null,"Łazienka","0.2","03. Łazienka","0.6",{"$nulls":4},"Vitovent 300-W 600m3/h lewa"]
[null,"Kuchnia otwarta z kuchenką elektryczną","0.3","04. Kuchnia","0.2",{"$nulls":4},"Vitovent 300-W 600m3/h prawa"]
[null,"","10","","0.3",{"$nulls":4},"Vitoair FS 300E MA 300m3/h"]
[null,"","10","","10"]
[null,"Spiżarnia","0.6","04.a Spiżarnia","10"]
[null,"","10","","10",{"$nulls":4},"Sterowanie",{"$nulls":4},"Vitoair","Vitovent","spr.",{"$nulls":4},"Sterowanie",{"$nulls":4},"Vitoair","Vitovent","spr.",{"$nulls":7},"Sterowanie",{"$nulls":4},"Vitoair","Vitovent","spr."]
[null,"","10","","10",{"$nulls":4},"Vitotrol 300-E",{"$nulls":4},"x",null,{"$f":"IF($N$57=\"Vitoair FS 300E MA 300m3/h\",1,0)","v":1},{"$nulls":4},"Vitotrol 300-E",{"$nulls":4},"x",null,{"$f":"IF($Y$57=\"Vitoair FS 300E MA 300m3/h\",1,0)","v":1},{"$nulls":7},"Vitotrol 300-E",{"$nulls":4},"x",null,{"$f":"IF($Y$57=\"Vitoair FS 300E MA 300m3/h\",1,0)","v":1}]
[null,"","10","","10",{"$nulls":4},"Przełącznik 4-stopniowy",{"$nulls":4},"x",null,{"$f":"IF($N$57=\"Vitoair FS 300E MA 300m3/h\",1,0)","v":1},{"$nulls":4},"Przełącznik 4-stopniowy",{"$nulls":4},"x",null,{"$f":"IF($Y$57=\"Vitoair FS 300E MA 300m3/h\",1,0)","v":1},{"$nulls":7},"Przełącznik 4-stopniowy",{"$nulls":4},"x",null,{"$f":"IF($Y$57=\"Vitoair FS 300E MA 300m3/h\",1,0)","v":1}]
[null,"","10","","10",{"$nulls":4},"Moduł obsługowy ścienny LB1",{"$nulls":5},"x",{"$f":"IF($N$57<>\"Vitoair FS 300E MA 300m3/h\",1,0)","v":0},{"$nulls":4},"Moduł obsługowy ścienny LB1",{"$nulls":5},"x",{"$f":"IF($Y$57<>\"Vitoair FS 300E MA 300m3/h\",1,0)","v":0},{"$nulls":7},"Moduł obsługowy ścienny LB1",{"$nulls":5},"x",{"$f":"IF($Y$57<>\"Vitoair FS 300E MA 300m3/h\",1,0)","v":0}]
[null,"","10","","10",{"$nulls":4},"Przewód połączeniowy Vitocal (WO1C)",{"$nulls":5},"x",{"$f":"IF($N$57<>\"Vitoair FS 300E MA 300m3/h\",1,0)","v":0},{"$nulls":4},"Przewód połączeniowy Vitocal (WO1C)",{"$nulls":5},"x",{"$f":"IF($Y$57<>\"Vitoair FS 300E MA 300m3/h\",1,0)","v":0},{"$nulls":7},"Przewód połączeniowy Vitocal (WO1C)",{"$nulls":5},"x",{"$f":"IF($Y$57<>\"Vitoair FS 300E MA 300m3/h\",1,0)","v":0}]
[null,"","10","","10",{"$nulls":4},"Sterowanie przez aplikację ViCare",{"$nulls":11},"Sterowanie przez aplikację ViCare",{"$nulls":14},"Sterowanie przez aplikację ViCare"]
[null,{"$f":"IF(C21=\"wywiew\",D21,IF(C21=\"naw.wyw.\",D21,\"\"))","v":""},{"$f":"IF(C21=\"wywiew\",B21,IF(C21=\"naw.wyw.\",B21,\"10\"))","v":"10"},"","10"]
[null,"","10","","10",{"$nulls":4},{"$f":"IF(N57<>\"Vitoair FS 300E MA 300m3/h\",J70,J68)","v":"Vitotrol 300-E"},{"$nulls":3},"Wybor:",{"$nulls":7},{"$f":"IF(Y57<>\"Vitoair FS 300E MA 300m3/h\",V70,V68)","v":"Vitotrol 300-E"},{"$nulls":3},"Wybor:",{"$nulls":10},{"$f":"IF(AN57<>\"Vitoair FS 300E MA 300m3/h\",AK70,AK68)","v":"Moduł obsługowy ścienny LB1"},{"$nulls":3},"Wybor:"]
[null,"","10","","10",{"$nulls":4},{"$f":"IF(N57<>\"Vitoair FS 300E MA 300m3/h\",J71,J69)","v":"Przełącznik 4-stopniowy"},{"$nulls":3},{"$f":"'System DN63'!X154","v":"Sterowanie przez aplikację ViCare"},{"$nulls":7},{"$f":"IF(Y57<>\"Vitoair FS 300E MA 300m3/h\",V71,V69)","v":"Przełącznik 4-stopniowy"},{"$nulls":3},{"$f":"'System DN75'!X154","v":"Moduł obsługowy ścienny LB1"},{"$nulls":10},{"$f":"IF(AN57<>\"Vitoair FS 300E MA 300m3/h\",AK71,AK69)","v":"Przewód połączeniowy Vitocal (WO1C)"},{"$nulls":3},{"$f":"'System DN90'!X154","v":"Moduł obsługowy ścienny LB1"}]
[null,"","10","","10",{"$nulls":4},{"$f":"IF(N57=\"Vitoair FS 300E MA 300m3/h\",\"Sterowanie przez aplikację ViCare\",\"\")","v":"Sterowanie przez aplikację ViCare"},{"$nulls":11},{"$f":"IF(Z57=\"Vitoair FS 300E MA 300m3/h\",\"Sterowanie przez aplikację ViCare\",\"\")","v":""},{"$nulls":14},{"$f":"IF(AO57=\"Vitoair FS 300E MA 300m3/h\",\"Sterowanie przez aplikację ViCare\",\"\")","v":""}]
[null,"","10","","10",{"$nulls":4},{"$f":"IF(N57=\"Vitoair FS 300E MA 300m3/h\",\"Przewód komunikacyjny Can-Bus 5m\",\"\")","v":"Przewód komunikacyjny Can-Bus 5m"},{"$nulls":11},{"$f":"IF(Y57=\"Vitoair FS 300E MA 300m3/h\",\"Przewód komunikacyjny Can-Bus 5m\",\"\")","v":"Przewód komunikacyjny Can-Bus 5m"},{"$nulls":14},{"$f":"IF(AN57=\"Vitoair FS 300E MA 300m3/h\",\"Przewód komunikacyjny Can-Bus 5m\",\"\")","v":""}]
[null,"","10","","10",{"$nulls":4},{"$f":"IF(N57=\"Vitoair FS 300E MA 300m3/h\",\"Bez komunikacji z pompą ciepła\",\"\")","v":"Bez komunikacji z pompą ciepła"},{"$nulls":11},{"$f":"IF(Y57=\"Vitoair FS 300E MA 300m3/h\",\"Bez komunikacji z pompą ciepła\",\"\")","v":"Bez komunikacji z pompą ciepła"},{"$nulls":14},{"$f":"IF(AN57=\"Vitoair FS 300E MA 300m3/h\",\"Bez komunikacji z pompą ciepła\",\"\")","v":""}]
[null,"","10","","10"]
[null,"","10","","10"]
[{"$nulls":3},"",{"$nulls":5},"Sprawdzenie kompatybilności",{"$nulls":11},"Sprawdzenie kompatybilności",{"$nulls":14},"Sprawdzenie kompatybilności"]
[null,{"$f":"21-COUNTBLANK(B61:B80)","v":5},{"$nulls":7},{"$f":"IF(N57=\"Vitoair FS 300E MA 300m3/h\",IF(N75=J68,\"\",IF(N75=J69,\"\",IF(N75=J72,\"\",\"Uwaga! Niewłaściwe dopasowanie sposobu sterowania do wybranej centrali\"))),IF(N75=J70,\"\",IF(N75=J71,\"\",\"Uwaga! Niewłaściwe dopasowanie sposobu sterowania do wybranej centrali\")))","v":""},{"$nulls":11},{"$f":"IF(Y57=\"Vitoair FS 300E MA 300m3/h\",IF(Z75=V68,\"\",IF(Z75=V69,\"\",IF(Z75=V72,\"\",\"Uwaga! Niewłaściwe dopasowanie sposobu sterowania do wybranej centrali\"))),IF(Z75=V70,\"\",IF(Z75=V71,\"\",\"Uwaga! Niewłaściwe dopasowanie sposobu sterowania do wybranej centrali\")))","v":"Uwaga! Niewłaściwe dopasowanie sposobu sterowania do wybranej centrali"},{"$nulls":14},{"$f":"IF(AN57=\"Vitoair FS 300E MA 300m3/h\",IF(AO75=AK68,\"\",IF(AO75=AK69,\"\",IF(AO75=AK72,\"\",\"Uwaga! Niewłaściwe dopasowanie sposobu sterowania do wybranej centrali\"))),IF(AO75=AK70,\"\",IF(AO75=AK71,\"\",\"Uwaga! Niewłaściwe dopasowanie sposobu sterowania do wybranej centrali\")))","v":""}]
[{"$nulls":9},{"$f":"IF(N57=J56,\"\",IF(N57=J57,\"\",IF(N57=J58,\"\",IF(N57=J59,\"\",IF(N57=J60,\"\",IF(N57=J61,\"\",IF(N57=J64,\"\",IF(N57=J63,\"\",IF(N57=J62,\"\",\"Uwaga! Błąd doboru centrali\")))))))))","v":""}]
[{"$nulls":21},{"$f":"IF(Y57=J56,\"\",IF(Y57=J57,\"\",IF(Y57=J58,\"\",IF(Y57=J59,\"\",IF(Y57=J60,\"\",IF(Y57=J61,\"\",IF(Y57=J62,\"\",IF(Y57=J63,\"\",IF(Y57=J64,\"\",\"Uwaga! Błąd doboru centrali\")))))))))","v":""},{"$nulls":14},{"$f":"IF(AN57=J56,\"\",IF(AN57=J57,\"\",IF(AN57=J58,\"\",IF(AN57=J59,\"\",IF(AN57=J60,\"\",IF(AN57=J61,\"\",IF(AN57=J62,\"\",IF(AN57=J63,\"\",IF(AN57=J64,\"\",\"Uwaga! Błąd doboru centrali\")))))))))","v":""}]
[]
[]
[null,"Koszty eksploatacyjne wentylacji grawitacyjnej"]
[null,"Kubatura",null,{"$f":"Dane!H184","v":{"v":301.676,"d":"302"}},"m3"]
[null,"Wymiana grawitacja",null,{"$f":"D88*0.5","v":150.838},"m3/h"]
[]
[null,"X",{"$f":"$D$89*1.2/3600*D91*24*31","v":430.189976},{"$f":"$J$92-E91","v":11.5},8.5,null,"średnie miesięczne temeratury dla Wawy 1981-2010"]
[null,"XI",{"$f":"$D$89*1.2/3600*D92*24*31","v":632.1922255999999},16.9,3.1,null,"dla budynku zakładamy",null,null,20,"[stC]"]
[null,"XII",774.3419567999998,20.7,-0.7]
[null,"I",781.8235215999999,20.9,-0.9]
[null,"II",785.564304,21,-1]
[null,"III",647.1553551999999,17.3,2.7]
[null,"IV",426.44919359999994,11.4,8.6]
[]
[null,"Suma",{"$f":"SUM(C91:C98)","v":{"v":4477.716532799999,"d":"4477.72"}},"[kWh]"]
[]
[]
[]
[]
[null,"Koszty eksploatacyjne wentylacji mechanicznej"]
[null,"Q=V/3600*1,2*1*deltaT"]
[null,"V obliczony =",{"$f":"D88","v":301.676},{"$f":"D90","v":0},"12h z wydajnością 50% i 12h z wydajnością 100%"]
[]
[null,"1. Koszt - sprawność reku, różnicę trzeba zagrzać"]
[null,"sprawność całoroczna (z karty ErP)",0.85]
[null,{"$f":"1.5*365/2*C106*(1-C109)*3*1.2*24/3600","v":297.30169800000004},"[kWh/rok]","dla deltaT=3K"]
[]
[null,"2. Koszt - praca wentylatorów"]
[null,"Moc wentylatorów trybie normalnym",27,"[W]","1/2 roku = 1/2*8650h",null,{"$f":"C113*8760/2000*0.85*2","v":201.042},"[kWh]"]
[null,"Moc wentylatorów w trybie zredukowanym",27,"[W]","1/2 roku = 1/2*8650h",null,{"$f":"C114*8760/2000*0.9*2","v":212.86800000000002},"[kWh]"]
[]
[{"$nulls":5},"Suma",{"$f":"SUM(G113:G115)","v":413.91},"[kWh]",null,{"$f":"G116*0.62","v":256.62420000000003}]
[]
[null,"3. Koszt - praca grzałki elektrycznej",null,null,"średnia ważona",null,"1/2 z 50% wydajnością i 1/2 ze 100% wydajnością"]
[null,"Kraków od 0 do -5stC",{"$f":"1868-540","v":1328},"[h]",-1,null,{"$f":"($C$125/2*1.2/3600*($C$126-E119)*C119/2)+($C$125*1.2/3600*($C$126-E119)*C119/2)","v":{"v":100.15643199999998,"d":"100.16"}},"[kWh]"]
[null,"Kraków od -5 do -10stC",{"$f":"540-108","v":432},"[h]",-6.5,null,{"$f":"($C$125/2*1.2/3600*($C$126-E120)*C120/2)+($C$125*1.2/3600*($C$126-E120)*C120/2)","v":{"v":211.77655199999998,"d":"211.78"}},"[kWh]"]
[null,"Kraków od -10 do -20stC",108,"[h]",-12,null,{"$f":"($C$125/2*1.2/3600*($C$126-E121)*C121/2)+($C$125*1.2/3600*($C$126-E121)*C121/2)","v":{"v":97.74302399999999,"d":"97.74"}},"[kWh]"]
[]
[{"$nulls":5},"Suma",{"$f":"SUM(G119:G122)","v":{"v":409.67600799999997,"d":"409.68"}},"[kWh]"]
[null,"Q=V/3600*1,2*1*deltaT"]
[null,"V obliczony =",{"$f":"D88","v":{"v":301.676,"d":"302"}},"[m3/h]",null,"krotność dla rekuperacji"]
[null,null,0,"[stC]",null,"temperatura zabez. przed zamar."]

{"sheet":"Dane techniczne","index":9,"n_rows":53,"n_cols":11,"rows_kept":53,"hidden":true}
[]
[{"$nulls":3},"300-W","300-W","300-W","300-W","300-W","300-F","300-C","FS"]
[null,"Model",null,"H32S A300","H32S A400","H32S C325","H32S C400","H32S A600","H32S B280","300-C","300E MA"]
[null,"Wydajność masymalna","m3/h",300,400,325,400,600,280,150,300]
[null,"Jednostkowe zużycie energii - klimat umiarkowany"]
[null,"- sterowanie czasowe","kWh/m2*rok",-38,-37,-42,-41,null,-36,-34,-37]
[null,"- sterowanie centralne zapotrzebowaniem","kWh/m2*rok",-40,-39,-43,-43,null,-38,-36,-39]
[null,"- sterowanie lokalne zapotrzebowaniem","kWh/m2*rok",-43,-42,-45,-45,null,-42,-41,-42]
[null,"Jednostkowe zużycie energii - klimat zimny"]
[null,"- sterowanie czasowe","kWh/m2*rok",-76,-74,-80,-81,null,-74,-71,-73]
[null,"- sterowanie centralne zapotrzebowaniem","kWh/m2*rok",-78,-77,-82,-82,null,-77,-74,-75]
[null,"- sterowanie lokalne zapotrzebowaniem","kWh/m2*rok",-82,-81,-84,-85,null,-81,-79,-79]
[null,"Klasa energetyczna - klimat umiarkowany"]
[null,"- sterowanie czasowe",null,"A","A","A","A","A","A","A","A"]
[null,"- sterowanie centralne zapotrzebowaniem",null,"A","A","A+","A+","A","A","A","A"]
[null,"- sterowanie lokalne zapotrzebowaniem",null,"A+","A+","A+","A+","A+","A+","A","A"]
[null,"Srawność odzysku ciepła UOC","%",0.86,0.85,{"v":0.91,"d":"91%"},{"v":0.92,"d":"92%"},{"v":0.92,"d":"92%"},{"v":0.89,"d":"89%"},{"v":0.83,"d":"83%"},{"v":0.8,"d":"80%"}]
[null,"Sprawność odzysku wilgoci","%",null,null,"n.d.","n.d.","n.d.","n.d.","n.d.",{"v":0.74,"d":"74%"}]
[null,"Maksymalna wartość natężenia przepływu","m3/h",300,400,325,400,600,280,150,300]
[null,"Efektywna moc wejściowa -max. pobór mocy wentylatorów","W",92,142,145,193,288,138,64,150]
[null,"Poziom mocy akustycznej L(WA)","dB(A)",44,48,41,50,49,44,38,39]
[null,"Jednostkowy pobór mocy JPM","W/m3/h",0.21,0.24,0.15,0.17,0.25,0.32,0.33,0.19]
[null,"Maksymalny wewnętrzny przeciek powietrza","%",0.8,0.4,2.85,2.85,null,0.54,0.9,0.9]
[null,"Maksymalny zewnętrzny przeciek powietrza","%",2.1,1.3,2.85,2.85,null,0.99,2.3,1.3]
[null,"Roczne zużycie energii elektrycznej - klimat umiarkowany"]
[null,"- sterowanie czasowe","kWh/100m2*rok",282,316,215,237,null,407,418,260]
[null,"- sterowanie centralne zapotrzebowaniem","kWh/100m2*rok",235,262,181,199,null,335,344,218]
[null,"- sterowanie lokalne zapotrzebowaniem","kWh/100m2*rok",156,172,124,135,null,214,220,105]
[null,"Roczne zużycie energii elektrycznej - klimat zimny"]
[null,"- sterowanie czasowe","kWh/100m2*rok",819,853,752,774,null,944,955,797]
[null,"- sterowanie centralne zapotrzebowaniem","kWh/100m2*rok",772,799,718,736,null,872,881,754]
[null,"- sterowanie lokalne zapotrzebowaniem","kWh/100m2*rok",693,709,661,672,null,751,757,683]
[null,"Roczne oszczędności w ogrzewaniu - klimat umiarkowany"]
[null,"- sterowanie czasowe","kWh/100m2*rok",4477,4447,4628,4658,null,4562,4386,4295]
[null,"- sterowanie centralne zapotrzebowaniem","kWh/100m2*rok",4521,4494,4657,4684,null,4597,4440,4359]
[null,"- sterowanie lokalne zapotrzebowaniem","kWh/100m2*rok",4611,4590,4714,4735,null,4669,4548,4486]
[null,"Roczne oszczędności w ogrzewaniu - klimat zimny"]
[null,"- sterowanie czasowe","kWh/100m2*rok",8758,8699,9054,9133,null,8924,8580,8403]
[null,"- sterowanie centralne zapotrzebowaniem","kWh/100m2*rok",8845,8792,9110,9163,null,8993,8686,8527]
[null,"- sterowanie lokalne zapotrzebowaniem","kWh/100m2*rok",9019,8979,9222,9263,null,9133,8898,8776]
[null,"Wyposażenie"]
[null,"Grzałka elektryczna powietrza zewnętrznego",null,"Tak","Tak","Tak","Tak","Tak","Tak","Tak","Opcja"]
[null,"Klasa by-pass",null,"Tak","Tak","Tak","Tak","Tak","Tak","Tak","Tak, double"]
[null,"Regulator w komplecie ?",null,"Nie","Nie","Nie","Nie","Nie","Nie","Nie","ViCare"]
[null,"Typ regulatora",null,"LB1","LB1","LB1","LB1","LB1","n.d.","LB1","App, 300-E"]
[null,"Sterowanie z poziomu pompy ciepła",null,"Tak","Tak","Tak","Tak","Tak","Tak","Tak","Tak, E3"]
[null,"Sterowanie z kotła",null,"Nie","Nie","Nie","Nie","Nie","Nie","Nie","Nie"]
[null,"Wymiary"]
[null,"Szerokość","mm",677,677,750,750,850,400,null,808]
[null,"Wysokość","mm",843,843,650,650,800,1486,null,248]
[null,"Głębokość","mm",540,540,560,560,660,680,null,1254]
[null,"Masa całkowita","kg",39,39,41,42.5,53,80,null,51]
[null,"Sprawność energetyczna wg EN308:1997","%",null,null,"do 98","do 99","do 99"]

{"sheet":"Zmiany","index":10,"n_rows":43,"n_cols":19,"rows_kept":43,"merged":[[2,12,3,12],[2,13,3,14],[2,17,3,18],[7,2,8,14],[10,2,11,9],[15,2,15,3],[15,5,15,6],[15,17,15,18],[18,2,18,3],[21,2,21,3],[25,2,25,3],[28,2,28,3],[31,2,31,3],[34,2,34,3],[37,2,37,3],[40,2,40,3]]}
[]
[]
[{"$nulls":12},"Data:   ",{"$f":"TODAY()","v":"2023-10-25"},{"$nulls":3},{"$f":"Dane!S3","v":"wersja 23/10/2023"}]
[]
[]
[]
[]
[null,null,"Program doborowy centralnej wentylacji mechanicznej z odzyskiem ciepła"]
[]
[]
[null,null,"Raport wprowadzonych zmian"]
[]
[]
[]
[]
[null,null,"Termin zmiany",null,null,"Komentarz",{"$nulls":11},"Status"]
[]
[]
[null,null,"2023-10-23",null,null,"Poprawki i aktualizacje danych",{"$nulls":11},{"$f":"IF(S19=\"istotna\",1,0.1)","v":1},"istotna"]
[]
[]
[null,null,"2023-03-30",null,null,"Aktualizacja zakresu oferty komponentów systemu dystrybucji powietrza",{"$nulls":11},{"$f":"IF(S22=\"istotna\",1,0.1)","v":1},"istotna"]
[{"$nulls":5},"Nowa centrala Vitovent 300-W o wydajności 600 m3/h"]
[]
[]
[null,null,"2023-01-04",null,null,"Aktualizacja cen na styczeń 2023",{"$nulls":11},{"$f":"IF(S26=\"istotna\",1,0.1)","v":1},"istotna"]
[]
[]
[null,null,"2022-11-05",null,null,"Usunięcie błędu w oznaczeniach średnic kanałów wybranych central wentylacyjnych",{"$nulls":11},{"$f":"IF(S29=\"istotna\",1,0.1)","v":1},"istotna"]
[]
[]
[null,null,"2022-07-04",null,null,"Aktualizacja cen ",{"$nulls":11},{"$f":"IF(S32=\"istotna\",1,0.1)","v":1},"istotna"]
[]
[]
[null,null,"2022-06-15",null,null,"Zmieniono drobne opisy w programie",{"$nulls":11},{"$f":"IF(S35=\"istotna\",1,0.1)","v":0.1},"informacyjna"]
[]
[]
[null,null,"2022-05-16",null,null,"Dodano obliczenia dla systemu opartego o kanały okrągłe DN90",{"$nulls":11},{"$f":"IF(S38=\"istotna\",1,0.1)","v":1},"istotna"]
[]
[]
[null,null,"2022-04-19",null,null,"Start"]
[]
[{"$nulls":17},{"$f":"[2]Obliczenia!Q199","v":"Autor:"},{"$f":"[2]Obliczenia!R199","v":"PanD, 2022"}]

{"sheet":"Warunki","index":11,"n_rows":187,"n_cols":14,"rows_kept":187,"hidden":true,"merged":[[1,2,1,3],[1,4,1,6],[2,4,2,5],[3,4,3,5],[165,6,165,8],[166,6,166,8],[167,6,167,8],[168,6,168,8],[169,6,169,8],[170,6,170,8],[171,6,171,8],[172,6,172,8],[173,6,173,8],[174,6,174,8],[175,6,175,8],[176,6,176,8],[177,6,177,8],[178,6,178,8],[179,6,179,8]]}
[]
[null,null,"Norma (wartości minimalne)",null,"Zalecenia",{"$nulls":3},true]
[null,null,"Nawiew","Wywiew","Krotność wymiany",null,"Strumień powietrza"]
[{"$nulls":4},"[1/h]",null,"[m3/h]"]
[null,null,"1 / osobę","1/ osobę","min","max"]
[null,"Pokój dzienny",20,null,1,1,null,"nawiew",{"$f":"IF($I$2=TRUE,60,75)","v":60}]
[null,"Gabinet",20,null,1,1,null,"nawiew",{"$f":"IF($I$2=TRUE,60,75)","v":60}]
[null,"Sypialnia",20,null,1,1,null,"nawiew",60]
[null,"Salon",20,null,1,1,null,"nawiew",60]
[null,"Jadalnia - nawiew",20,null,1,1,null,"nawiew",60]
[null,"Pomieszczenie / nawiew",20,null,1,1,null,"nawiew",60]
[null,"Pomieszczenie / wywiew",20,null,1,1,null,"wywiew",60]
[null,null,"[m3/h]","[m3/h]"]
[null,"Kuchnia otwarta z kuchenką gazową",null,70,2,2,null,"wywiew",75]
[null,"Kuchnia otwarta z kuchenką elektryczną",null,50,2,2,null,"wywiew",75]
[null,"Jadalnia - wywiew",null,20]
[null,"Pomieszczenie / wywiew",null,20]
[null,"Łazienka",null,50,2,3,null,"wywiew",75]
[null,"WC (bez wanny lub kabiny prysznicowej)",null,30,2,3,null,"wywiew",75]
[null,"Klatka schodowa, hol",null,0,null,1,50,"wywiew",75]
[null,"Pomieszczenie gospodarcze",null,15,1,1,null,"wywiew",75]
[null,"Garderoba",null,15,0.5,0.5,null,"wywiew",75]
[null,"Wiatrołap",null,15,0.5,0.5,null,"wywiew",75]
[null,"Pomieszczenie rekreacyjne",20,20,2,2,null,"wywiew",60]
[null,"Pralnia, suszarnia",null,0,2,2,null,"wywiew",75]
[null,"Spiżarnia",null,15,1,1,null,"wywiew",75]
[null,"Kotłownia z kotłem grupy C lub pompą ciepła",15,15,1,1,null,"wywiew",75]
[null,"Garaż",{"$nulls":5},"nawiew"]
[]
[]
[]
[null,null,{"v":0.34,"d":"0.34 zł"}]
[null,null,{"v":0.54,"d":"0.54 zł"}]
[null,null,{"v":1.05,"d":"1.05 zł"}]
[]
[]
[null,"Wytyczne projektowe"]
[null,"- - - - - - - - - - - - - - - NAWIEW - - - - - - - - - - - - - - -"]
[null,{"$f":"B6","v":"Pokój dzienny"}]
[null,{"$f":"B7","v":"Gabinet"}]
[null,{"$f":"B8","v":"Sypialnia"}]
[null,{"$f":"B9","v":"Salon"}]
[null,"Jadalnia - nawiew"]
[null,{"$f":"B11","v":"Pomieszczenie / nawiew"}]
[null,"- - - - - - - - - - - - - - - WYWIEW - - - - - - - - - - - - - - -"]
[null,{"$f":"B12","v":"Pomieszczenie / wywiew"}]
[null,{"$f":"B14","v":"Kuchnia otwarta z kuchenką gazową"}]
[null,{"$f":"B15","v":"Kuchnia otwarta z kuchenką elektryczną"}]
[null,"Jadalnia - wywiew"]
[null,{"$f":"B18","v":"Łazienka"}]
[null,"WC (bez wanny lub kabiny prysznicowej)"]
[null,"Klatka schodowa, hol"]
[null,"Pomieszczenie gospodarcze"]
[null,"Garderoba"]
[null,"Wiatrołap"]
[null,"Pomieszczenie rekreacyjne"]
[null,"Pralnia, suszarnia"]
[null,"Spiżarnia"]
[null,"Kotłownia z kotłem grupy C lub pompą ciepła"]
[null,"Garaż"]
{"$rows_empty":33}
[null,"Uwagi i zalecenia dotyczące instalacji rozprowadzania powietrza"]
[]
[null,"• Ewentualny kominek będzie pobierał powietrze do spalania odzielnym kanałem z zewnątrz"]
[null,"• Okap kuchenny będzie pracował na powietrzu obiegowym"]
[null,"• Dokładne lokalizacje nawieników i wywiewników, należy ustalić w koordynacji z innymi branżami oraz aranżacją wnętrz"]
[null,"• Inwestor zapewni 80mm przestrzeni w warstwach posadzkowych na system kanałów wentylacyjnych"]
[null,"• Zaprojektować przewody rurowe tak, aby się nie krzyżowały."]
[null,"• Czerpnia i wyrzutnia elewacyjne będą zlokalizowane, co najmniej 2 m ponad poziomem terenu"]
[null,"• Rozdzielacze będę zlokalizowane bezpośrednio na stropie parteru, wewnątrz izolacji termicznej spełniającej warunki paroszczelności"]
[null,"• Przewodów DN 63 bez izolacji nie wolno prowadzić w przestrzeni powietrznej poddasza"]
[null,"• Nie stosować dłuższych odcinków przewodów DN63 niż 25m"]
[null,"• Aby umożliwić przepływ powietrza z obszarów nawiewnych do obszarów wywiewnych, należy zapewnić szczeliną pod drzwiami."]
[null,"• Podczas montażu instalacji wentylacji należy systematycznie zaślepiać wszystkie otwory, aby zabezpieczyć ją przed zapyleniem."]
[null,"• Zaleca się stosowanie tłumików na odcinku od centrali wentylacyjnej do rozdzielacza powietrza nawiewanego do pomieszczeń"]
[]
[null,"Uwagi i zalecenia dotyczące centrali wentylacyjnej"]
[]
[null,"• Centralę wentylacyjną należy ustawiać wewnątrz pomieszczeń ogrzewanych"]
[null,"• Centralę wentylacyjną można zamontować w pozycji stojącej lub wiszącej"]
[null,"• Należy zapewnić swobodny dostęp do centrali wentylacyjnej w celu wykonania prac konserwacyjnych"]
[]
[null,"Uwagi i zalecenia dotyczące eksploatacji centrali wentylacyjnej"]
[]
[null,"• Panel zdalnego sterowania należy umieścić w ogólnodostępnym miejscu"]
[null,"• Należy kontrolować jakość filtrów i w razie konieczności wymienić na nowe"]
[]
[null,"Koszty eksploatacyjne wentylacji grawitacyjnej"]
[null,"Q=V/3600*1,2*1*deltaT"]
[null,"Kubatura =",null,"[m3]"]
[null,"V obliczony =",null,"[m3/h]",{"$f":"IFERROR(C123/C122,\"błąd\")","v":"błąd"},"krotność dla rekuperacji"]
[null,"V do obliczeń kosztów pod grawitację =",{"$f":"C122*E124","v":0},"[m3/h]",0.5,"krotność dla grawitacji"]
[]
[null,"X",{"$f":"$C$124*1.2/3600*D126*24*31","v":0},{"$f":"$H$127-E126","v":11.5},8.5,"średnie miesięczne temeratury dla Wawy 1981-2010"]
[null,"XI",{"$f":"$C$124*1.2/3600*D127*24*30","v":0},{"$f":"$H$127-E127","v":16.9},3.1,"dla budynku zakładamy",null,20,"[stC]"]
[null,"XII",{"$f":"$C$124*1.2/3600*D128*24*31","v":0},20.7,-0.7]
[null,"I",{"$f":"$C$124*1.2/3600*D129*24*31","v":0},20.9,-0.9]
[null,"II",{"$f":"$C$124*1.2/3600*D130*24*28","v":0},21,-1]
[null,"III",{"$f":"$C$124*1.2/3600*D131*24*31","v":0},17.3,2.7]
[null,"IV",{"$f":"$C$124*1.2/3600*D132*24*30","v":0},11.4,8.6]
[]
[null,"Suma",{"$f":"SUM(C126:C133)","v":{"v":0,"d":"0.00"}},"[kWh]"]
[]
[]
[null,"Koszty eksploatacyjne wentylacji mechanicznej"]
[null,"Q=V/3600*1,2*1*deltaT"]
[null,"V obliczony =",null,{"$f":"D123","v":"[m3/h]"},"12h z wydajnością 50% i 12h z wydajnością 100%"]
[]
[null,"1. Koszt - sprawność reku, różnicę trzeba zagrzać"]
[null,"sprawność całoroczna (z karty ErP)",0.85]
[null,{"$f":"1.5*365/2*C139*(1-C142)*3*1.2*24/3600","v":0},"[kWh/rok]","dla deltaT=3K"]
[]
[null,"2. Koszt - praca wentylatorów"]
[null,"Moc wentylatorów trybie normalnym",null,"[W]","1/2 roku = 1/2*8650h",null,{"$f":"C146*8760/2000*0.85*2","v":0},"[kWh]"]
[null,"Moc wentylatorów w trybie zredukowanym",null,"[W]","1/2 roku = 1/2*8650h",null,{"$f":"C147*8760/2000*0.9*2","v":0},"[kWh]"]
[]
[{"$nulls":5},"Suma",{"$f":"SUM(G146:G148)","v":0},"[kWh]",null,{"$f":"G149*0.62","v":0},{"$f":"J149/12","v":0}]
[]
[null,"3. Koszt - praca grzałki elektrycznej",null,null,"średnia ważona",null,"1/2 z 50% wydajnością i 1/2 ze 100% wydajnością"]
[null,"Kraków od 0 do -5stC",{"$f":"1868-540","v":1328},"[h]",-1,null,{"$f":"($C$158/2*1.2/3600*($C$159-E152)*C152/2)+($C$158*1.2/3600*($C$159-E152)*C152/2)","v":{"v":0,"d":"0.00"}},"[kWh]"]
[null,"Kraków od -5 do -10stC",{"$f":"540-108","v":432},"[h]",-6.5,null,{"$f":"($C$158/2*1.2/3600*($C$159-E153)*C153/2)+($C$158*1.2/3600*($C$159-E153)*C153/2)","v":{"v":0,"d":"0.00"}},"[kWh]"]
[null,"Kraków od -10 do -20stC",108,"[h]",-12,null,{"$f":"($C$158/2*1.2/3600*($C$159-E154)*C154/2)+($C$158/2*1.2/3600*($C$159-E154)*C154/2)","v":{"v":0,"d":"0.00"}},"[kWh]"]
[]
[{"$nulls":5},"Suma",{"$f":"SUM(G152:G155)","v":{"v":0,"d":"0.00"}},"[kWh]"]
[null,"Q=V/3600*1,2*1*deltaT"]
[null,"V obliczony =",null,"[m3/h]",null,"krotność dla rekuperacji"]
[null,null,0,"[stC]",null,"temperatura zabez. przed zamar."]
[]
[]
[]
[]
[]
[null,"-------- NAWIEW --------"]
[null,"Pokój dzienny",null,1,"nawiew",null,{"$f":"Dane!E32","v":"Wiatrołap"},{"$nulls":4},"Funkcja",{"$f":"INDEX($B$166:$C$187,MATCH($G$166,nawiew_wywiew_lista2,0),2)","v":0},{"$f":"MATCH(G166,$B$166:$B$186,0)","v":17}]
[null,"Gabinet",null,2,"nawiew",null,{"$f":"Dane!E38","v":"Łazienka"},{"$nulls":4},"Funkcja",{"$f":"INDEX($B$166:$C$187,MATCH($G$167,nawiew_wywiew_lista2,0),2)","v":0},12]
[null,"Sypialnia",null,3,"nawiew",null,{"$f":"Dane!E44","v":"Kuchnia otwarta z kuchenką elektryczną"},{"$nulls":4},"Funkcja",{"$f":"INDEX($B$166:$C$187,MATCH($G$168,nawiew_wywiew_lista2,0),2)","v":0},11]
[null,"Salon",null,4,"nawiew",null,{"$f":"Dane!E50","v":"Jadalnia - nawiew"},{"$nulls":4},"Funkcja",{"$f":"INDEX($B$166:$C$187,MATCH($G$169,nawiew_wywiew_lista2,0),2)","v":0},5]
[null,"Jadalnia - nawiew",null,5,"nawiew",null,{"$f":"Dane!E56","v":"Salon"},{"$nulls":4},"Funkcja",{"$f":"INDEX($B$166:$C$187,MATCH($G$170,nawiew_wywiew_lista2,0),2)","v":0},4]
[null,"Pomieszczenie / nawiew",null,6,"nawiew",null,{"$f":"Dane!$E$62","v":"Spiżarnia"},{"$nulls":4},"Funkcja",{"$f":"INDEX($B$166:$C$187,MATCH($G$171,nawiew_wywiew_lista2,0),2)","v":0},20]
[null,"-------- WYWIEW --------",{"$nulls":4},{"$f":"Dane!$E$68","v":0}]
[null,"Pomieszczenie / wywiew",null,7,"wywiew",null,{"$f":"Dane!E74","v":0},{"$nulls":4},"Funkcja",{"$f":"INDEX($B$166:$C$187,MATCH($G$173,nawiew_wywiew_lista2,0),2)","v":0},{"$f":"MATCH(G173,$B$166:$B$186,0)","v":{"$error":"#N/A"}}]
[null,"Kuchnia otwarta z kuchenką gazową",null,8,"wywiew",null,{"$f":"Dane!E80","v":0},{"$nulls":4},"Funkcja",{"$f":"INDEX($B$166:$C$187,MATCH($G$174,nawiew_wywiew_lista2,0),2)","v":0},{"$f":"MATCH(G174,$B$166:$B$186,0)","v":{"$error":"#N/A"}}]
[null,"Jadalnia - wywiew",null,9,"wywiew",null,{"$f":"Dane!E86","v":0}]
[null,"Kuchnia otwarta z kuchenką elektryczną",null,10,"wywiew",null,{"$f":"Dane!E92","v":0},{"$nulls":4},"Funkcja",{"$f":"INDEX($B$166:$C$187,MATCH($G$176,nawiew_wywiew_lista2,0),2)","v":0},{"$f":"MATCH(G176,$B$166:$B$186,0)","v":{"$error":"#N/A"}}]
[null,"Łazienka",null,11,"wywiew",null,{"$f":"Dane!E98","v":0},{"$nulls":4},"Funkcja",{"$f":"INDEX($B$166:$C$187,MATCH($G$177,nawiew_wywiew_lista2,0),2)","v":0},{"$f":"MATCH(G177,$B$166:$B$186,0)","v":{"$error":"#N/A"}}]
[null,"WC (bez wanny lub kabiny prysznicowej)",null,12,"wywiew",null,{"$f":"Dane!E121","v":0},{"$nulls":4},"Funkcja",{"$f":"INDEX($B$166:$C$187,MATCH($G$178,nawiew_wywiew_lista2,0),2)","v":0},{"$f":"MATCH(G178,$B$166:$B$186,0)","v":{"$error":"#N/A"}}]
[null,"Klatka schodowa, hol",null,13,"wywiew",null,{"$f":"Dane!E126","v":0},{"$nulls":4},"Funkcja",{"$f":"INDEX($B$166:$C$187,MATCH($G$179,nawiew_wywiew_lista2,0),2)","v":0},{"$error":"#N/A"}]
[null,"Pomieszczenie gospodarcze",null,14,"wywiew",null,{"$f":"Dane!E132","v":0}]
[null,"Garderoba",null,15,"wywiew",null,{"$f":"Dane!E138","v":0},{"$nulls":4},"Funkcja",{"$f":"INDEX($B$166:$C$187,MATCH($G$181,nawiew_wywiew_lista2,0),2)","v":0},{"$f":"MATCH(G181,$B$166:$B$186,0)","v":{"$error":"#N/A"}}]
[null,"Wiatrołap",null,16,"wywiew",null,{"$f":"Dane!E144","v":0},{"$nulls":4},"Funkcja",{"$f":"INDEX($B$166:$C$187,MATCH($G$182,nawiew_wywiew_lista2,0),2)","v":0},{"$f":"MATCH(G182,$B$166:$B$186,0)","v":{"$error":"#N/A"}}]
[null,"Pomieszczenie rekreacyjne",null,17,"wywiew",null,{"$f":"Dane!E150","v":0},{"$nulls":4},"Funkcja",{"$f":"INDEX($B$166:$C$187,MATCH($G$183,nawiew_wywiew_lista2,0),2)","v":0},{"$f":"MATCH(G183,$B$166:$B$186,0)","v":{"$error":"#N/A"}}]
[null,"Pralnia, suszarnia",null,18,"wywiew",null,{"$f":"Dane!E156","v":0},{"$nulls":4},"Funkcja",{"$f":"INDEX($B$166:$C$187,MATCH($G$184,nawiew_wywiew_lista2,0),2)","v":0},{"$f":"MATCH(G184,$B$166:$B$186,0)","v":{"$error":"#N/A"}}]
[null,"Spiżarnia",null,19,"wywiew",null,{"$f":"Dane!E162","v":0},{"$nulls":4},"Funkcja",{"$f":"INDEX($B$166:$C$187,MATCH($G$185,nawiew_wywiew_lista2,0),2)","v":0},{"$f":"MATCH(G185,$B$166:$B$186,0)","v":{"$error":"#N/A"}}]
[null,"Kotłownia z kotłem grupy C lub pompą ciepła",null,20,"naw.wyw."]
[null,0,null,20]

{"sheet":"obliczenia-temp","index":12,"n_rows":43,"n_cols":26,"rows_kept":43,"hidden":true,"merged":[[14,2,15,2],[14,3,15,5],[14,8,15,8],[14,9,15,9],[14,10,15,10],[14,11,15,11],[14,12,15,12],[14,13,15,13],[14,14,15,14],[14,15,15,15],[14,16,15,16],[16,3,16,5],[17,3,17,5],[18,3,18,5],[19,3,19,5],[20,3,20,5],[21,3,21,5],[22,3,22,5],[23,3,23,5],[24,3,24,5],[25,3,25,5],[28,3,28,5],[29,3,29,5],[30,3,30,5],[31,3,31,5],[32,3,32,5],[33,3,33,5],[34,3,34,5],[35,3,35,5],[36,3,36,5],[37,3,37,5],[42,2,49,15]]}
[]
[{"$nulls":6},"Arkusz obliczeniowy systemu wentylacji centralnej z odzyskiem ciepła",{"$nulls":18},"Parter"]
[{"$nulls":25},"Poddasze"]
[{"$nulls":6},"Ilość kondygnacji",null,2]
[]
[{"$nulls":6},"Lokalizacja centrali","f","Parter"]
[]
[]
[]
[]
[]
[{"$nulls":8},"dane obliczone"]
[{"$nulls":8},"dane do wprowadzenia"]
[{"$nulls":3},"Wybierz pomieszczenie z listy i wprowadź wartości"]
[null,null,"Nr pom.","Nazwa pomieszczenia",null,null,"Pow.","Kubatura","Założona krotność wymiany","Wydatek\nz krotności","Wydatek\nminimalny","Ilość osób","Wydatek z ilości osób","Założony nawiew","Założony nawiew","Założony wywiew","Założony wywiew"]
[{"$nulls":6},"[m2]","[m3]"]
[null,null,"0.1","Wiatrołap",null,null,3.2,{"$f":"G17*2.65","v":{"v":8.48,"d":"8.5"}},{"$f":"VLOOKUP(D17,warunki2,5,FALSE)","v":0.5},{"$f":"I17*H17","v":{"v":4.24,"d":"4.2"}},{"$f":"IF(VLOOKUP(D17,warunki2,3,FALSE)=20,0,VLOOKUP(D17,warunki2,3,FALSE))","v":{"v":15,"d":"15.0"}},null,{"$f":"L17*20","v":0},{"$f":"IFERROR(VLOOKUP(D17,nawiew4,1,),0)","v":"Wiatrołap"},{"$f":"IF(N17=0,\" \",MROUND(IF(J17>K17,J17,K17),5))","v":15},{"$f":"IFERROR(VLOOKUP(D17,wywiew3,1,),0)","v":0},{"$f":"IF(P17=0,\" \",MROUND(IF(J17>K17,J17,K17),5))","v":" "}]
[null,null,"0.2","Klatka schodowa, hol",null,null,18.3,{"$f":"G18*2.65","v":{"v":48.495,"d":"48.5"}},1,{"$f":"I18*H18","v":{"v":48.495,"d":"48.5"}},{"v":0,"d":"0.0"},null,0,0,{"$f":"IF(N18=0,\" \",MROUND(IF(J18>K18,J18,K18),5))","v":" "},"Klatka schodowa, hol",{"$f":"IF(P18=0,\" \",MROUND(IF(J18>K18,J18,K18),5))","v":50}]
[null,null,"0.3","Kuchnia otwarta z kuchenką elektryczną",null,null,12.7,{"v":33.654999999999994,"d":"33.7"},2,{"v":67.30999999999999,"d":"67.3"},{"v":50,"d":"50.0"},null,0,0," ","Kuchnia otwarta z kuchenką elektryczną",65]
[null,null,"0.4","Spiżarnia",null,null,3.2,{"v":8.48,"d":"8.5"},1,{"v":8.48,"d":"8.5"},{"v":15,"d":"15.0"},null,0,"Spiżarnia",15,0," "]
[null,null,"0.5","Jadalnia",null,null,12.7,{"v":33.654999999999994,"d":"33.7"},{"$error":"#N/A"},{"$error":"#N/A"},{"$error":"#N/A"},null,0,0," ",0," "]
[null,null,"0.6","Pokój dzienny",null,null,29.5,{"v":78.175,"d":"78.2"},{"$error":"#N/A"},{"$error":"#N/A"},{"$error":"#N/A"},null,0,0," ","Pokój dzienny",{"$error":"#N/A"}]
[null,null,"0.7","Gabinet",null,null,10.7,{"v":28.354999999999997,"d":"28.4"},{"$error":"#N/A"},{"$error":"#N/A"},{"$error":"#N/A"},2,40,0," ","Gabinet",{"$error":"#N/A"}]
[null,null,"0.8","WC (bez wanny lub kabiny prysznicowej)",null,null,3,{"v":7.949999999999999,"d":"8.0"},3,{"v":23.849999999999998,"d":"23.9"},{"v":30,"d":"30.0"},null,0,0," ","WC (bez wanny lub kabiny prysznicowej)",30]
[null,null,"0.9","Kotłownia z kotłem grupy C",null,null,7.3,{"v":19.345,"d":"19.3"},{"$error":"#N/A"},{"$error":"#N/A"},{"$error":"#N/A"},null,0,0," ",0," "]
[null,null,"0.10","Garaż",null,null,41.1,{"v":108.915,"d":"108.9"},0,{"v":0,"d":"0.0"},{"v":0,"d":"0.0"},null,0,"Garaż",0,0," "]
[{"$nulls":6},{"$f":"SUM(G17:G26)&\" [m2]\"","v":"141,7 [m2]"},{"$nulls":5},"suma",null,{"$f":"SUM(O17:O26)","v":30},null,{"$f":"SUM(Q17:Q26)","v":{"$error":"#N/A"}},"[m3/h]"]
[]
[null,null,"1.1","Pokój dzienny",null,null,25.7,{"$f":"G29*2.65","v":{"v":68.10499999999999,"d":"68.1"}},{"$f":"VLOOKUP(D29,warunki2,5,FALSE)","v":{"$error":"#N/A"}},{"$error":"#N/A"},{"$f":"IF(VLOOKUP(D29,warunki2,3,FALSE)=20,0,VLOOKUP(D29,warunki2,3,FALSE))","v":{"$error":"#N/A"}},2,{"$f":"L29*20","v":40},{"$f":"IFERROR(VLOOKUP(D29,nawiew4,1,),0)","v":0},{"$f":"IF(N29=0,\" \",MROUND(IF(J29>K29,J29,K29),5))","v":" "},{"$f":"IFERROR(VLOOKUP(D29,wywiew3,1,),0)","v":"Pokój dzienny"},{"$f":"IF(P29=0,\" \",MROUND(IF(J29>K29,J29,K29),5))","v":{"$error":"#N/A"}}]
[null,null,"1.2","Sypialnia",null,null,18.6,{"$f":"G30*2.65","v":{"v":49.29,"d":"49.3"}},{"$error":"#N/A"},{"$error":"#N/A"},{"$error":"#N/A"},2,40,0,{"$f":"IF(N30=0,\" \",MROUND(IF(J30>K30,J30,K30),5))","v":" "},"Sypialnia",{"$f":"IF(P30=0,\" \",MROUND(IF(J30>K30,J30,K30),5))","v":{"$error":"#N/A"}}]
[null,null,"1.3","Łazienka",null,null,6.9,{"$f":"G31*2.65","v":{"v":18.285,"d":"18.3"}},3,54.855000000000004,{"v":50,"d":"50.0"},null,0,0," ","Łazienka",55]
[null,null,"1.4","Garderoba",null,null,4.9,{"v":12.985000000000001,"d":"13.0"},0.5,6.492500000000001,{"v":15,"d":"15.0"},null,0,"Garderoba",15,0," "]
[null,null,"1.5","Pokój dzienny",null,null,18.9,{"v":50.084999999999994,"d":"50.1"},{"$error":"#N/A"},{"$error":"#N/A"},{"$error":"#N/A"},2,40,0," ","Pokój dzienny",{"$error":"#N/A"}]
[null,null,"1.6","Pokój dzienny",null,null,18.9,{"v":50.084999999999994,"d":"50.1"},{"$error":"#N/A"},{"$error":"#N/A"},{"$error":"#N/A"},2,40,0," ","Pokój dzienny",{"$error":"#N/A"}]
[null,null,"1.7","Pomieszczenie rekreacyjne",null,null,18.6,{"v":49.29,"d":"49.3"},2,98.58,{"v":0,"d":"0.0"},null,0,"Pomieszczenie rekreacyjne",100,0," "]
[null,null,"1.8","Łazienka",null,null,11,{"v":29.15,"d":"29.2"},3,87.44999999999999,{"v":50,"d":"50.0"},null,0,0," ","Łazienka",85]
[null,null,"1.9",{"$nulls":4},{"v":0,"d":"0.0"},{"$error":"#N/A"},{"$error":"#N/A"},{"$error":"#N/A"},null,0,0," ",0," "]
[null,null,"1.10",{"$nulls":4},{"v":0,"d":"0.0"},{"$error":"#N/A"},{"$error":"#N/A"},{"$error":"#N/A"},null,0,0," ",0," "]
[{"$nulls":6},{"$f":"SUM(G29:G38)&\" [m2]\"","v":"123,5 [m2]"},{"$nulls":5},"suma",null,{"$f":"SUM(O29:O38)","v":115},null,{"$f":"SUM(Q29:Q38)","v":{"$error":"#N/A"}},"[m3/h]"]
[]
[{"$nulls":6},{"$f":"SUM(G17:G26,G29:G38)&\" [m2]\"","v":"265,2 [m2]"},null,"Projektowa wydajność centrali wentylacyjnej [m3/h]:",{"$nulls":5},{"$f":"O39+O27","v":145},null,{"$f":"Q39+Q27","v":{"$error":"#N/A"}},"[m3/h]"]
[]
[null,null,"Wartości istotne :\n1. Ilość mieszkańców, pomieszczenia stale wykorzystywane w ciągu dnia itd\n2. Rodzaj kuchnia, otwarta/zamknięta, z kuchenką elektryczną/gazową\n3. Ewentualny kominek będzie pobierał powietrze do spalania odzielnym kanałem z zewnątrz\n4. Okap kuchenny będzie pracował na powietrzu obiegowym\n5. Lokalizacja centrali parter/poddasze\n6. Dokładne lokalizacje nawieników i wywiewników, należy ustalić w koordynacji z innymi branżami oraz aranżacją wnętrz\n7. Inwestor zapewni 80mm przestrzeni w warstwach posadzkowych na system kanałów wentylacyjnych"]

{"sheet":"Arkusz1","index":13,"n_rows":38,"n_cols":21,"rows_kept":38,"hidden":true,"merged":[[1,1,1,4],[3,1,4,1],[3,2,4,2],[3,5,4,5],[3,6,4,6],[3,7,4,7],[3,8,4,8],[3,9,4,9],[3,10,4,10],[3,12,3,13],[3,14,3,15],[5,8,17,8],[20,8,30,8],[37,1,37,10]]}
[]
[null,"Bilans powietrza"]
[]
[null,"Nr pom.","Nazwa pom.","Pow.","Kubatura","Założona krot.wym.","Wydatek z krotności","Wydatek z ilości os.",null,"Założony nawiew","Założony wywiew",null,"Ilość anemostatów",null,"Ilość kanałów"]
[{"$nulls":3},"[m2]","[m3]",{"$nulls":7},"naw.","wyw.","naw.","wyw."]
[]
[null,"0.1",null,null,{"$f":"D7*2.7","v":{"v":0,"d":"0.0"}},null,{"$f":"E7*F7","v":0}]
[null,"0.2",null,null,{"$f":"D8*2.7","v":{"v":0,"d":"0.0"}},null,{"$f":"E8*F8","v":0}]
[null,"0.3",null,null,{"v":0,"d":"0.0"},null,0]
[null,"0.4",null,null,{"v":0,"d":"0.0"},null,0]
[null,"0.5",null,null,{"v":0,"d":"0.0"},null,0]
[null,"0.6",null,null,{"v":0,"d":"0.0"},null,0]
[null,"0.7",null,null,{"v":0,"d":"0.0"},null,0,{"$nulls":12},{"$f":"X6","v":0},{"$f":"X6","v":0}]
[null,"0.8",null,null,{"v":0,"d":"0.0"},null,0]
[null,"0.9",null,null,{"v":0,"d":"0.0"},null,0]
[null,"0.10",null,null,{"v":0,"d":"0.0"},null,0]
[null,"0.11",null,null,{"v":0,"d":"0.0"},null,0]
[]
[{"$nulls":9},{"$f":"SUM(J7:J17)","v":0},{"$f":"SUM(K7:K17)","v":0}]
[]
[null,"1.1",null,null,{"$f":"D21*2.5","v":{"v":0,"d":"0.0"}},null,{"$f":"E21*F21","v":0}]
[null,"1.2",null,null,{"$f":"D22*2.5","v":{"v":0,"d":"0.0"}},null,{"$f":"E22*F22","v":0}]
[null,"1.3",null,null,{"$f":"D23*2.5","v":{"v":0,"d":"0.0"}},null,0]
[null,"1.4",null,null,{"v":0,"d":"0.0"},null,0]
[null,"1.5",null,null,{"v":0,"d":"0.0"},null,0]
[null,"1.6",null,null,{"v":0,"d":"0.0"},null,0]
[null,"1.7",null,null,{"v":0,"d":"0.0"},null,0]
[null,"1.8",null,null,{"v":0,"d":"0.0"},null,0]
[null,"1.9",null,null,{"v":0,"d":"0.0"},null,0]
[null,"1.10",null,null,{"v":0,"d":"0.0"},null,0]
[]
[{"$nulls":9},{"$f":"SUM(J21:J31)","v":0},{"$f":"SUM(K21:K31)","v":0},null,{"$f":"SUM(M6:M31)","v":0},{"$f":"SUM(N6:N31)","v":0},{"$f":"SUM(O6:O31)","v":0},{"$f":"SUM(P6:P31)","v":0}]
[]
[{"$nulls":4},"Projektowa wydajność centrali wentylacyjnej [m3/h]:",{"$nulls":4},{"$f":"J32+J19","v":0},{"$f":"K32+K19","v":0}]
[]
[null,"Założenia:"]
[]
[null,"1. Ilość mieszkańców: 4 osoby\n2. Kuchnia wyposażona w kuchenkę elektryczną\n3. Ewentualny kominek będzie pobierał powietrze do spalania odzielnym kanałem z zewnątrz\n4. Okap będzie pracował na powietrzu obiegowym\n5. Lokalizacja centrali - kotłownia na parterze\n6. Dokładne lokalizacje nawieników i wywiewników, należy ustalić w koordynacji z innymi branżami oraz aranżacją wnętrz\n7. Inwestor zapewni 80mm przestrzeni w warstwach posadzkowych na system kanałów wentylacyjnych\n"]